{"text_format":"1","workbook":"xlsx","n_sheets":18,"sheets":["INICIO","AS1","DOC1","PRAC1","AUT1","PARCIAL1","INFORME1","AS2","DOC2","PRAC2","AUT2","PARCIAL2","INFORME2","FINAL","INFORME ACADEMICO","ESTADIS","Hoja1","RESERVADO"],"not_rendered":{"charts":2,"images":8,"macros":1,"external_links":0,"defined_names":45,"comments":0,"pivot_tables":0},"unopened":[],"bounds":{"document_bytes":16777216,"sheet_cells":100000,"rows_first":2000,"rows_last":500,"rows_between":2000,"halvings":0,"cell_chars":16384,"cell_head_chars":4096},"cells_cut":0,"cells_raw":0,"read":"whole","date_system":"1900"}

{"sheet":"INICIO","index":0,"n_rows":15,"n_cols":8,"rows_kept":15,"cut":false,"hidden":false,"merged":[[1,1,1,6],[14,1,14,8]]}
[]
[null,"REGISTRO ELECTRÓNICO ACADÉMICO DE ASISTENCIA Y CALIFICACION"]
[null,null,null,"INGRESE SUS DATOS",null,"PRIMER PARCIAL",null,"SEGUNDO PARCIAL"]
[null,null,"DOCENTE:","Graciela Rivera Herrera",null,"ASISTENCIA",null,"ASISTENCIA"]
[null,null,"FACULTAD:  ","Ciencias de la Salud"]
[null,null,"CARRERA: ","Enfermería",null,"ACTIVIDADES DE DOCENCIA",null,"ACTIVIDADES DE DOCENCIA"]
[null,null,"PERIODO ACADÉMICO: "," 2024 -  2025"]
[null,null,"SEMESTRE: ","6to",null,"PRÁCTICAS DE APLICACIÓN Y EXPERIMENTACIÓN",null,"PRÁCTICAS DE APLICACIÓN Y EXPERIMENTACIÓN"]
[null,null,"PARALELO: ","A"]
[null,null,"ESPECIALIDAD: ",null,null,"ACTIVIDADES DE APRENDIZAJE AUTÓNOMO",null,"ACTIVIDADES DE APRENDIZAJE AUTÓNOMO"]
[null,null,"ASIGNATURA: ","Enfermería Gíneco oObstétrica II"]
[null,null,"NRO. HORAS CLASE DIARIAS:",2,null,"ACTA DE CALIFICACIONES PRIMER PARCIAL",null,"ACTA DE CALIFICACIONES PRIMER PARCIAL"]
[]
[null,null,null,null,null,"ACTA FINAL DE CALIFICACIONES "]
[null,"PROGRAMA REGISTRADO 2021    -    Contacto:  svega@unach.edu.ec\n"]

{"sheet":"AS1","index":1,"n_rows":74,"n_cols":141,"rows_kept":74,"cut":false,"hidden":false,"merged":[[2,4,2,23],[1,57,2,58],[1,51,2,56]]}
[]
[null,null,null,null,null,null,null,null,null,null,null,"ASISTENCIAS REGISTRADAS EN EL PRIMER PARCIAL",null,null,null,null,null,null,null,null,null,null,null,null,null,null,null,null,null,null,null,null,null,null,null,null,null,null,null,null,null,null,null,null,null,null,null,null,null,null,null,"Total horas trabajadas",null,null,null,null,null,{"$f":"COUNT(F5:BE5)*INICIO!D12","v":52}]
[null,null,null,null,"RECUERDE USTED TIENE",null,null,null,null,null,null,null,null,null,null,null,null,null,null,null,null,null,null,null,{"$f":"INICIO!D12","v":2},"HORAS DE CLASE AL DÍA CON ESTE CURSO"]
[null,null,"N","NUMERO DE CÉDULA","APELLIDOS Y NOMBRES","2024-10-01","2024-10-02","2024-10-03","2024-10-08","2024-10-09","2024-10-10","2024-10-15","2024-10-16","2024-10-17","2024-10-22","2024-10-23","2024-10-24","2024-10-29","2024-10-30","2024-10-31","2024-11-05","2024-11-06","2024-11-07","2024-11-12","2024-11-13","2024-11-14","2024-11-19","2024-11-20","2024-11-21","2024-11-26","2024-11-27","2024-11-28",null,null,null,null,null,null,null,null,null,null,null,null,null,null,null,null,null,null,null,null,null,null,null,null,null,"HORAS ASISTIDAS","CALIFICACION ASISTENCIA"]
[null,null,1,null,"DAQUILEMA LONDO SHIRLEY ESTEFAFANÍA",null,2,2,2,2,2,2,2,2,2,2,2,2,2,2,2,2,2,2,2,2,2,2,2,2,2,2,null,null,null,null,null,null,null,null,null,null,null,null,null,null,null,null,null,null,null,null,null,null,null,null,null,{"$f":"SUM(F5:BE5)","v":52},{"$f":"IF(PARCIAL1!L$8=0,0,(ROUND(((BF5*10)/PARCIAL1!L$8),1)))","v":10},null,{"$f":"IF(E5>$Y$3,0,E5)","v":0},0,2,2,2,2,2,2,2,2,{"$f":"IF(O5>$Y$3,0,O5)","v":2},2,2,2,2,2,2,2,2,2,{"$f":"IF(Y5>$Y$3,0,Y5)","v":2},2,2,2,2,2,2,2,0,0,{"$f":"IF(AI5>$Y$3,0,AI5)","v":0},0,0,0,0,0,0,0,0,0,{"$f":"IF(AS5>$Y$3,0,AS5)","v":0},0,0,0,0,0,0,0,0,0,{"$f":"IF(BC5>$Y$3,0,BC5)","v":0},0,0,{"$f":"IF(#REF!>$Y$3,0,#REF!)","v":{"$error":"#REF!"}},{"$f":"IF(#REF!>$Y$3,0,#REF!)","v":{"$error":"#REF!"}},{"$f":"IF(#REF!>$Y$3,0,#REF!)","v":{"$error":"#REF!"}},{"$f":"IF(#REF!>$Y$3,0,#REF!)","v":{"$error":"#REF!"}},{"$f":"IF(#REF!>$Y$3,0,#REF!)","v":{"$error":"#REF!"}},{"$f":"IF(#REF!>$Y$3,0,#REF!)","v":{"$error":"#REF!"}},{"$f":"IF(#REF!>$Y$3,0,#REF!)","v":{"$error":"#REF!"}},{"$f":"IF(#REF!>$Y$3,0,#REF!)","v":{"$error":"#REF!"}},{"$f":"IF(#REF!>$Y$3,0,#REF!)","v":{"$error":"#REF!"}},{"$f":"IF(#REF!>$Y$3,0,#REF!)","v":{"$error":"#REF!"}},{"$f":"IF(#REF!>$Y$3,0,#REF!)","v":{"$error":"#REF!"}},{"$f":"IF(#REF!>$Y$3,0,#REF!)","v":{"$error":"#REF!"}},{"$f":"IF(#REF!>$Y$3,0,#REF!)","v":{"$error":"#REF!"}},{"$f":"IF(#REF!>$Y$3,0,#REF!)","v":{"$error":"#REF!"}},{"$f":"IF(#REF!>$Y$3,0,#REF!)","v":{"$error":"#REF!"}},{"$f":"IF(#REF!>$Y$3,0,#REF!)","v":{"$error":"#REF!"}},{"$f":"IF(#REF!>$Y$3,0,#REF!)","v":{"$error":"#REF!"}},{"$f":"IF(#REF!>$Y$3,0,#REF!)","v":{"$error":"#REF!"}},{"$f":"IF(#REF!>$Y$3,0,#REF!)","v":{"$error":"#REF!"}},{"$f":"IF(#REF!>$Y$3,0,#REF!)","v":{"$error":"#REF!"}},{"$f":"IF(#REF!>$Y$3,0,#REF!)","v":{"$error":"#REF!"}},{"$f":"IF(#REF!>$Y$3,0,#REF!)","v":{"$error":"#REF!"}},{"$f":"IF(#REF!>$Y$3,0,#REF!)","v":{"$error":"#REF!"}},{"$f":"IF(#REF!>$Y$3,0,#REF!)","v":{"$error":"#REF!"}},{"$f":"IF(#REF!>$Y$3,0,#REF!)","v":{"$error":"#REF!"}},{"$f":"IF(#REF!>$Y$3,0,#REF!)","v":{"$error":"#REF!"}},{"$f":"IF(#REF!>$Y$3,0,#REF!)","v":{"$error":"#REF!"}},{"$f":"IF(#REF!>$Y$3,0,#REF!)","v":{"$error":"#REF!"}}]
[null,null,2,null,"GOYES ORTIZ NATASHA DAYANA",2,2,2,2,2,2,2,2,2,2,2,2,2,2,2,2,2,2,null,null,null,null,null,2,2,2,2,null,null,null,null,null,null,null,null,null,null,null,null,null,null,null,null,null,null,null,null,null,null,null,null,null,{"$f":"SUM(F6:BE6)","v":44},{"$f":"IF(PARCIAL1!L$8=0,0,(ROUND(((BF6*10)/PARCIAL1!L$8),1)))","v":8.5},null,{"$f":"IF(E6>$Y$3,0,E6)","v":0},2,2,2,2,2,2,2,2,2,2,2,2,2,2,2,2,2,2,0,0,0,0,0,2,2,2,2,0,0,0,0,0,0,0,0,0,0,0,0,0,0,0,0,0,0,0,0,0,0,0,0,0,{"$f":"IF(#REF!>$Y$3,0,#REF!)","v":{"$error":"#REF!"}},{"$f":"IF(#REF!>$Y$3,0,#REF!)","v":{"$error":"#REF!"}},{"$f":"IF(#REF!>$Y$3,0,#REF!)","v":{"$error":"#REF!"}},{"$f":"IF(#REF!>$Y$3,0,#REF!)","v":{"$error":"#REF!"}},{"$f":"IF(#REF!>$Y$3,0,#REF!)","v":{"$error":"#REF!"}},{"$f":"IF(#REF!>$Y$3,0,#REF!)","v":{"$error":"#REF!"}},{"$f":"IF(#REF!>$Y$3,0,#REF!)","v":{"$error":"#REF!"}},{"$f":"IF(#REF!>$Y$3,0,#REF!)","v":{"$error":"#REF!"}},{"$f":"IF(#REF!>$Y$3,0,#REF!)","v":{"$error":"#REF!"}},{"$f":"IF(#REF!>$Y$3,0,#REF!)","v":{"$error":"#REF!"}},{"$f":"IF(#REF!>$Y$3,0,#REF!)","v":{"$error":"#REF!"}},{"$f":"IF(#REF!>$Y$3,0,#REF!)","v":{"$error":"#REF!"}},{"$f":"IF(#REF!>$Y$3,0,#REF!)","v":{"$error":"#REF!"}},{"$f":"IF(#REF!>$Y$3,0,#REF!)","v":{"$error":"#REF!"}},{"$f":"IF(#REF!>$Y$3,0,#REF!)","v":{"$error":"#REF!"}},{"$f":"IF(#REF!>$Y$3,0,#REF!)","v":{"$error":"#REF!"}},{"$f":"IF(#REF!>$Y$3,0,#REF!)","v":{"$error":"#REF!"}},{"$f":"IF(#REF!>$Y$3,0,#REF!)","v":{"$error":"#REF!"}},{"$f":"IF(#REF!>$Y$3,0,#REF!)","v":{"$error":"#REF!"}},{"$f":"IF(#REF!>$Y$3,0,#REF!)","v":{"$error":"#REF!"}},{"$f":"IF(#REF!>$Y$3,0,#REF!)","v":{"$error":"#REF!"}},{"$f":"IF(#REF!>$Y$3,0,#REF!)","v":{"$error":"#REF!"}},{"$f":"IF(#REF!>$Y$3,0,#REF!)","v":{"$error":"#REF!"}},{"$f":"IF(#REF!>$Y$3,0,#REF!)","v":{"$error":"#REF!"}},{"$f":"IF(#REF!>$Y$3,0,#REF!)","v":{"$error":"#REF!"}},{"$f":"IF(#REF!>$Y$3,0,#REF!)","v":{"$error":"#REF!"}},{"$f":"IF(#REF!>$Y$3,0,#REF!)","v":{"$error":"#REF!"}},{"$f":"IF(#REF!>$Y$3,0,#REF!)","v":{"$error":"#REF!"}}]
[null,null,3,null,"GUADALUPE RUIZ YULISA NATALY",null,2,2,2,2,2,2,2,2,2,2,2,2,2,2,2,2,2,2,2,2,2,2,2,2,2,2,null,null,null,null,null,null,null,null,null,null,null,null,null,null,null,null,null,null,null,null,null,null,null,null,null,{"$f":"SUM(F7:BE7)","v":52},{"$f":"IF(PARCIAL1!L$8=0,0,(ROUND(((BF7*10)/PARCIAL1!L$8),1)))","v":10},null,null,{"$f":"IF(F7>$Y$3,0,F7)","v":0},{"$f":"IF(G7>$Y$3,0,G7)","v":2},{"$f":"IF(H7>$Y$3,0,H7)","v":2},{"$f":"IF(I7>$Y$3,0,I7)","v":2},{"$f":"IF(J7>$Y$3,0,J7)","v":2},{"$f":"IF(K7>$Y$3,0,K7)","v":2},{"$f":"IF(L7>$Y$3,0,L7)","v":2},{"$f":"IF(M7>$Y$3,0,M7)","v":2},{"$f":"IF(N7>$Y$3,0,N7)","v":2},{"$f":"IF(O7>$Y$3,0,O7)","v":2},{"$f":"IF(P7>$Y$3,0,P7)","v":2},{"$f":"IF(Q7>$Y$3,0,Q7)","v":2},{"$f":"IF(R7>$Y$3,0,R7)","v":2},{"$f":"IF(S7>$Y$3,0,S7)","v":2},{"$f":"IF(T7>$Y$3,0,T7)","v":2},{"$f":"IF(U7>$Y$3,0,U7)","v":2},{"$f":"IF(V7>$Y$3,0,V7)","v":2},{"$f":"IF(W7>$Y$3,0,W7)","v":2},{"$f":"IF(X7>$Y$3,0,X7)","v":2},{"$f":"IF(Y7>$Y$3,0,Y7)","v":2},{"$f":"IF(Z7>$Y$3,0,Z7)","v":2},{"$f":"IF(AA7>$Y$3,0,AA7)","v":2},{"$f":"IF(AB7>$Y$3,0,AB7)","v":2},{"$f":"IF(AC7>$Y$3,0,AC7)","v":2},{"$f":"IF(AD7>$Y$3,0,AD7)","v":2},{"$f":"IF(AE7>$Y$3,0,AE7)","v":2},{"$f":"IF(AF7>$Y$3,0,AF7)","v":2},{"$f":"IF(AG7>$Y$3,0,AG7)","v":0},{"$f":"IF(AH7>$Y$3,0,AH7)","v":0},{"$f":"IF(AI7>$Y$3,0,AI7)","v":0},{"$f":"IF(AJ7>$Y$3,0,AJ7)","v":0},{"$f":"IF(AK7>$Y$3,0,AK7)","v":0},{"$f":"IF(AL7>$Y$3,0,AL7)","v":0},{"$f":"IF(AM7>$Y$3,0,AM7)","v":0},{"$f":"IF(AN7>$Y$3,0,AN7)","v":0},{"$f":"IF(AO7>$Y$3,0,AO7)","v":0},{"$f":"IF(AP7>$Y$3,0,AP7)","v":0},{"$f":"IF(AQ7>$Y$3,0,AQ7)","v":0},{"$f":"IF(AR7>$Y$3,0,AR7)","v":0},{"$f":"IF(AS7>$Y$3,0,AS7)","v":0},{"$f":"IF(AT7>$Y$3,0,AT7)","v":0},{"$f":"IF(AU7>$Y$3,0,AU7)","v":0},{"$f":"IF(AV7>$Y$3,0,AV7)","v":0},{"$f":"IF(AW7>$Y$3,0,AW7)","v":0},{"$f":"IF(AX7>$Y$3,0,AX7)","v":0},{"$f":"IF(AY7>$Y$3,0,AY7)","v":0},{"$f":"IF(AZ7>$Y$3,0,AZ7)","v":0},{"$f":"IF(BA7>$Y$3,0,BA7)","v":0},{"$f":"IF(BB7>$Y$3,0,BB7)","v":0},{"$f":"IF(BC7>$Y$3,0,BC7)","v":0},{"$f":"IF(BD7>$Y$3,0,BD7)","v":0},{"$f":"IF(BE7>$Y$3,0,BE7)","v":0},{"$f":"IF(#REF!>$Y$3,0,#REF!)","v":{"$error":"#REF!"}},{"$f":"IF(#REF!>$Y$3,0,#REF!)","v":{"$error":"#REF!"}},{"$f":"IF(#REF!>$Y$3,0,#REF!)","v":{"$error":"#REF!"}},{"$f":"IF(#REF!>$Y$3,0,#REF!)","v":{"$error":"#REF!"}},{"$f":"IF(#REF!>$Y$3,0,#REF!)","v":{"$error":"#REF!"}},{"$f":"IF(#REF!>$Y$3,0,#REF!)","v":{"$error":"#REF!"}},{"$f":"IF(#REF!>$Y$3,0,#REF!)","v":{"$error":"#REF!"}},{"$f":"IF(#REF!>$Y$3,0,#REF!)","v":{"$error":"#REF!"}},{"$f":"IF(#REF!>$Y$3,0,#REF!)","v":{"$error":"#REF!"}},{"$f":"IF(#REF!>$Y$3,0,#REF!)","v":{"$error":"#REF!"}},{"$f":"IF(#REF!>$Y$3,0,#REF!)","v":{"$error":"#REF!"}},{"$f":"IF(#REF!>$Y$3,0,#REF!)","v":{"$error":"#REF!"}},{"$f":"IF(#REF!>$Y$3,0,#REF!)","v":{"$error":"#REF!"}},{"$f":"IF(#REF!>$Y$3,0,#REF!)","v":{"$error":"#REF!"}},{"$f":"IF(#REF!>$Y$3,0,#REF!)","v":{"$error":"#REF!"}},{"$f":"IF(#REF!>$Y$3,0,#REF!)","v":{"$error":"#REF!"}},{"$f":"IF(#REF!>$Y$3,0,#REF!)","v":{"$error":"#REF!"}},{"$f":"IF(#REF!>$Y$3,0,#REF!)","v":{"$error":"#REF!"}},{"$f":"IF(#REF!>$Y$3,0,#REF!)","v":{"$error":"#REF!"}},{"$f":"IF(#REF!>$Y$3,0,#REF!)","v":{"$error":"#REF!"}},{"$f":"IF(#REF!>$Y$3,0,#REF!)","v":{"$error":"#REF!"}},{"$f":"IF(#REF!>$Y$3,0,#REF!)","v":{"$error":"#REF!"}},{"$f":"IF(#REF!>$Y$3,0,#REF!)","v":{"$error":"#REF!"}},{"$f":"IF(#REF!>$Y$3,0,#REF!)","v":{"$error":"#REF!"}},{"$f":"IF(#REF!>$Y$3,0,#REF!)","v":{"$error":"#REF!"}},{"$f":"IF(#REF!>$Y$3,0,#REF!)","v":{"$error":"#REF!"}},{"$f":"IF(#REF!>$Y$3,0,#REF!)","v":{"$error":"#REF!"}},{"$f":"IF(#REF!>$Y$3,0,#REF!)","v":{"$error":"#REF!"}}]
[null,null,4,null,"MELO CHAVEZ KEVIN JOSUE",2,2,2,2,2,2,2,2,2,2,2,2,2,2,2,2,2,2,2,2,2,2,2,2,2,2,2,null,null,null,null,null,null,null,null,null,null,null,null,null,null,null,null,null,null,null,null,null,null,null,null,null,{"$f":"SUM(F8:BE8)","v":54},{"$f":"IF(PARCIAL1!L$8=0,0,(ROUND(((BF8*10)/PARCIAL1!L$8),1)))","v":10.4},null,null,2,2,2,2,2,2,2,2,2,2,2,2,2,2,2,2,2,2,2,2,2,2,2,2,2,2,2,0,0,0,0,0,0,0,0,0,0,0,0,0,0,0,0,0,0,0,0,0,0,0,0,0,{"$f":"IF(#REF!>$Y$3,0,#REF!)","v":{"$error":"#REF!"}},{"$f":"IF(#REF!>$Y$3,0,#REF!)","v":{"$error":"#REF!"}},{"$f":"IF(#REF!>$Y$3,0,#REF!)","v":{"$error":"#REF!"}},{"$f":"IF(#REF!>$Y$3,0,#REF!)","v":{"$error":"#REF!"}},{"$f":"IF(#REF!>$Y$3,0,#REF!)","v":{"$error":"#REF!"}},{"$f":"IF(#REF!>$Y$3,0,#REF!)","v":{"$error":"#REF!"}},{"$f":"IF(#REF!>$Y$3,0,#REF!)","v":{"$error":"#REF!"}},{"$f":"IF(#REF!>$Y$3,0,#REF!)","v":{"$error":"#REF!"}},{"$f":"IF(#REF!>$Y$3,0,#REF!)","v":{"$error":"#REF!"}},{"$f":"IF(#REF!>$Y$3,0,#REF!)","v":{"$error":"#REF!"}},{"$f":"IF(#REF!>$Y$3,0,#REF!)","v":{"$error":"#REF!"}},{"$f":"IF(#REF!>$Y$3,0,#REF!)","v":{"$error":"#REF!"}},{"$f":"IF(#REF!>$Y$3,0,#REF!)","v":{"$error":"#REF!"}},{"$f":"IF(#REF!>$Y$3,0,#REF!)","v":{"$error":"#REF!"}},{"$f":"IF(#REF!>$Y$3,0,#REF!)","v":{"$error":"#REF!"}},{"$f":"IF(#REF!>$Y$3,0,#REF!)","v":{"$error":"#REF!"}},{"$f":"IF(#REF!>$Y$3,0,#REF!)","v":{"$error":"#REF!"}},{"$f":"IF(#REF!>$Y$3,0,#REF!)","v":{"$error":"#REF!"}},{"$f":"IF(#REF!>$Y$3,0,#REF!)","v":{"$error":"#REF!"}},{"$f":"IF(#REF!>$Y$3,0,#REF!)","v":{"$error":"#REF!"}},{"$f":"IF(#REF!>$Y$3,0,#REF!)","v":{"$error":"#REF!"}},{"$f":"IF(#REF!>$Y$3,0,#REF!)","v":{"$error":"#REF!"}},{"$f":"IF(#REF!>$Y$3,0,#REF!)","v":{"$error":"#REF!"}},{"$f":"IF(#REF!>$Y$3,0,#REF!)","v":{"$error":"#REF!"}},{"$f":"IF(#REF!>$Y$3,0,#REF!)","v":{"$error":"#REF!"}},{"$f":"IF(#REF!>$Y$3,0,#REF!)","v":{"$error":"#REF!"}},{"$f":"IF(#REF!>$Y$3,0,#REF!)","v":{"$error":"#REF!"}},{"$f":"IF(#REF!>$Y$3,0,#REF!)","v":{"$error":"#REF!"}}]
[null,null,5,null,"MULLO PAUCAR ADRIANA ANABEL",2,2,2,2,2,2,2,2,2,2,2,2,2,2,2,2,2,2,2,2,2,2,2,2,2,2,2,null,null,null,null,null,null,null,null,null,null,null,null,null,null,null,null,null,null,null,null,null,null,null,null,null,54,{"$f":"IF(PARCIAL1!L$8=0,0,(ROUND(((BF9*10)/PARCIAL1!L$8),1)))","v":10.4},null,null,2,2,2,2,2,2,2,2,2,2,2,2,2,2,2,2,2,2,2,2,2,2,2,2,2,2,2,0,0,0,0,0,0,0,0,0,0,0,0,0,0,0,0,0,0,0,0,0,0,0,0,0,{"$f":"IF(#REF!>$Y$3,0,#REF!)","v":{"$error":"#REF!"}},{"$f":"IF(#REF!>$Y$3,0,#REF!)","v":{"$error":"#REF!"}},{"$f":"IF(#REF!>$Y$3,0,#REF!)","v":{"$error":"#REF!"}},{"$f":"IF(#REF!>$Y$3,0,#REF!)","v":{"$error":"#REF!"}},{"$f":"IF(#REF!>$Y$3,0,#REF!)","v":{"$error":"#REF!"}},{"$f":"IF(#REF!>$Y$3,0,#REF!)","v":{"$error":"#REF!"}},{"$f":"IF(#REF!>$Y$3,0,#REF!)","v":{"$error":"#REF!"}},{"$f":"IF(#REF!>$Y$3,0,#REF!)","v":{"$error":"#REF!"}},{"$f":"IF(#REF!>$Y$3,0,#REF!)","v":{"$error":"#REF!"}},{"$f":"IF(#REF!>$Y$3,0,#REF!)","v":{"$error":"#REF!"}},{"$f":"IF(#REF!>$Y$3,0,#REF!)","v":{"$error":"#REF!"}},{"$f":"IF(#REF!>$Y$3,0,#REF!)","v":{"$error":"#REF!"}},{"$f":"IF(#REF!>$Y$3,0,#REF!)","v":{"$error":"#REF!"}},{"$f":"IF(#REF!>$Y$3,0,#REF!)","v":{"$error":"#REF!"}},{"$f":"IF(#REF!>$Y$3,0,#REF!)","v":{"$error":"#REF!"}},{"$f":"IF(#REF!>$Y$3,0,#REF!)","v":{"$error":"#REF!"}},{"$f":"IF(#REF!>$Y$3,0,#REF!)","v":{"$error":"#REF!"}},{"$f":"IF(#REF!>$Y$3,0,#REF!)","v":{"$error":"#REF!"}},{"$f":"IF(#REF!>$Y$3,0,#REF!)","v":{"$error":"#REF!"}},{"$f":"IF(#REF!>$Y$3,0,#REF!)","v":{"$error":"#REF!"}},{"$f":"IF(#REF!>$Y$3,0,#REF!)","v":{"$error":"#REF!"}},{"$f":"IF(#REF!>$Y$3,0,#REF!)","v":{"$error":"#REF!"}},{"$f":"IF(#REF!>$Y$3,0,#REF!)","v":{"$error":"#REF!"}},{"$f":"IF(#REF!>$Y$3,0,#REF!)","v":{"$error":"#REF!"}},{"$f":"IF(#REF!>$Y$3,0,#REF!)","v":{"$error":"#REF!"}},{"$f":"IF(#REF!>$Y$3,0,#REF!)","v":{"$error":"#REF!"}},{"$f":"IF(#REF!>$Y$3,0,#REF!)","v":{"$error":"#REF!"}},{"$f":"IF(#REF!>$Y$3,0,#REF!)","v":{"$error":"#REF!"}}]
[null,null,6,null,"NARANJO PALACIOS FERNANDA BRIGUITTE",2,2,2,2,2,2,2,2,2,null,null,null,null,null,null,null,null,null,null,null,null,null,null,null,null,null,null,null,null,null,null,null,null,null,null,null,null,null,null,null,null,null,null,null,null,null,null,null,null,null,null,null,18,{"$f":"IF(PARCIAL1!L$8=0,0,(ROUND(((BF10*10)/PARCIAL1!L$8),1)))","v":3.5},null,null,2,2,2,2,2,2,2,2,2,0,0,0,0,0,0,0,0,0,0,0,0,0,0,0,0,0,0,0,0,0,0,0,0,0,0,0,0,0,0,0,0,0,0,0,0,0,0,0,0,0,0,0,{"$f":"IF(#REF!>$Y$3,0,#REF!)","v":{"$error":"#REF!"}},{"$f":"IF(#REF!>$Y$3,0,#REF!)","v":{"$error":"#REF!"}},{"$f":"IF(#REF!>$Y$3,0,#REF!)","v":{"$error":"#REF!"}},{"$f":"IF(#REF!>$Y$3,0,#REF!)","v":{"$error":"#REF!"}},{"$f":"IF(#REF!>$Y$3,0,#REF!)","v":{"$error":"#REF!"}},{"$f":"IF(#REF!>$Y$3,0,#REF!)","v":{"$error":"#REF!"}},{"$f":"IF(#REF!>$Y$3,0,#REF!)","v":{"$error":"#REF!"}},{"$f":"IF(#REF!>$Y$3,0,#REF!)","v":{"$error":"#REF!"}},{"$f":"IF(#REF!>$Y$3,0,#REF!)","v":{"$error":"#REF!"}},{"$f":"IF(#REF!>$Y$3,0,#REF!)","v":{"$error":"#REF!"}},{"$f":"IF(#REF!>$Y$3,0,#REF!)","v":{"$error":"#REF!"}},{"$f":"IF(#REF!>$Y$3,0,#REF!)","v":{"$error":"#REF!"}},{"$f":"IF(#REF!>$Y$3,0,#REF!)","v":{"$error":"#REF!"}},{"$f":"IF(#REF!>$Y$3,0,#REF!)","v":{"$error":"#REF!"}},{"$f":"IF(#REF!>$Y$3,0,#REF!)","v":{"$error":"#REF!"}},{"$f":"IF(#REF!>$Y$3,0,#REF!)","v":{"$error":"#REF!"}},{"$f":"IF(#REF!>$Y$3,0,#REF!)","v":{"$error":"#REF!"}},{"$f":"IF(#REF!>$Y$3,0,#REF!)","v":{"$error":"#REF!"}},{"$f":"IF(#REF!>$Y$3,0,#REF!)","v":{"$error":"#REF!"}},{"$f":"IF(#REF!>$Y$3,0,#REF!)","v":{"$error":"#REF!"}},{"$f":"IF(#REF!>$Y$3,0,#REF!)","v":{"$error":"#REF!"}},{"$f":"IF(#REF!>$Y$3,0,#REF!)","v":{"$error":"#REF!"}},{"$f":"IF(#REF!>$Y$3,0,#REF!)","v":{"$error":"#REF!"}},{"$f":"IF(#REF!>$Y$3,0,#REF!)","v":{"$error":"#REF!"}},{"$f":"IF(#REF!>$Y$3,0,#REF!)","v":{"$error":"#REF!"}},{"$f":"IF(#REF!>$Y$3,0,#REF!)","v":{"$error":"#REF!"}},{"$f":"IF(#REF!>$Y$3,0,#REF!)","v":{"$error":"#REF!"}},{"$f":"IF(#REF!>$Y$3,0,#REF!)","v":{"$error":"#REF!"}}]
[null,null,7,null,"SOTO VARGAS ERIKA SAMANTA",2,2,2,2,2,2,2,2,2,2,2,2,2,2,2,2,2,2,2,2,2,2,2,2,2,2,2,null,null,null,null,null,null,null,null,null,null,null,null,null,null,null,null,null,null,null,null,null,null,null,null,null,54,{"$f":"IF(PARCIAL1!L$8=0,0,(ROUND(((BF11*10)/PARCIAL1!L$8),1)))","v":10.4},null,null,2,2,2,2,2,2,2,2,2,2,2,2,2,2,2,2,2,2,2,2,2,2,2,2,2,2,2,0,0,0,0,0,0,0,0,0,0,0,0,0,0,0,0,0,0,0,0,0,0,0,0,0,{"$f":"IF(#REF!>$Y$3,0,#REF!)","v":{"$error":"#REF!"}},{"$f":"IF(#REF!>$Y$3,0,#REF!)","v":{"$error":"#REF!"}},{"$f":"IF(#REF!>$Y$3,0,#REF!)","v":{"$error":"#REF!"}},{"$f":"IF(#REF!>$Y$3,0,#REF!)","v":{"$error":"#REF!"}},{"$f":"IF(#REF!>$Y$3,0,#REF!)","v":{"$error":"#REF!"}},{"$f":"IF(#REF!>$Y$3,0,#REF!)","v":{"$error":"#REF!"}},{"$f":"IF(#REF!>$Y$3,0,#REF!)","v":{"$error":"#REF!"}},{"$f":"IF(#REF!>$Y$3,0,#REF!)","v":{"$error":"#REF!"}},{"$f":"IF(#REF!>$Y$3,0,#REF!)","v":{"$error":"#REF!"}},{"$f":"IF(#REF!>$Y$3,0,#REF!)","v":{"$error":"#REF!"}},{"$f":"IF(#REF!>$Y$3,0,#REF!)","v":{"$error":"#REF!"}},{"$f":"IF(#REF!>$Y$3,0,#REF!)","v":{"$error":"#REF!"}},{"$f":"IF(#REF!>$Y$3,0,#REF!)","v":{"$error":"#REF!"}},{"$f":"IF(#REF!>$Y$3,0,#REF!)","v":{"$error":"#REF!"}},{"$f":"IF(#REF!>$Y$3,0,#REF!)","v":{"$error":"#REF!"}},{"$f":"IF(#REF!>$Y$3,0,#REF!)","v":{"$error":"#REF!"}},{"$f":"IF(#REF!>$Y$3,0,#REF!)","v":{"$error":"#REF!"}},{"$f":"IF(#REF!>$Y$3,0,#REF!)","v":{"$error":"#REF!"}},{"$f":"IF(#REF!>$Y$3,0,#REF!)","v":{"$error":"#REF!"}},{"$f":"IF(#REF!>$Y$3,0,#REF!)","v":{"$error":"#REF!"}},{"$f":"IF(#REF!>$Y$3,0,#REF!)","v":{"$error":"#REF!"}},{"$f":"IF(#REF!>$Y$3,0,#REF!)","v":{"$error":"#REF!"}},{"$f":"IF(#REF!>$Y$3,0,#REF!)","v":{"$error":"#REF!"}},{"$f":"IF(#REF!>$Y$3,0,#REF!)","v":{"$error":"#REF!"}},{"$f":"IF(#REF!>$Y$3,0,#REF!)","v":{"$error":"#REF!"}},{"$f":"IF(#REF!>$Y$3,0,#REF!)","v":{"$error":"#REF!"}},{"$f":"IF(#REF!>$Y$3,0,#REF!)","v":{"$error":"#REF!"}},{"$f":"IF(#REF!>$Y$3,0,#REF!)","v":{"$error":"#REF!"}}]
[null,null,8,null,"VALLEJO ORDOÑEZ SAYONARA ELIZABETH",2,2,2,2,2,2,2,2,2,2,2,2,2,2,2,2,2,2,2,2,2,2,2,2,2,2,2,null,null,null,null,null,null,null,null,null,null,null,null,null,null,null,null,null,null,null,null,null,null,null,null,null,54,{"$f":"IF(PARCIAL1!L$8=0,0,(ROUND(((BF12*10)/PARCIAL1!L$8),1)))","v":10.4},null,null,2,2,2,2,2,2,2,2,2,2,2,2,2,2,2,2,2,2,2,2,2,2,2,2,2,2,2,0,0,0,0,0,0,0,0,0,0,0,0,0,0,0,0,0,0,0,0,0,0,0,0,0,{"$f":"IF(#REF!>$Y$3,0,#REF!)","v":{"$error":"#REF!"}},{"$f":"IF(#REF!>$Y$3,0,#REF!)","v":{"$error":"#REF!"}},{"$f":"IF(#REF!>$Y$3,0,#REF!)","v":{"$error":"#REF!"}},{"$f":"IF(#REF!>$Y$3,0,#REF!)","v":{"$error":"#REF!"}},{"$f":"IF(#REF!>$Y$3,0,#REF!)","v":{"$error":"#REF!"}},{"$f":"IF(#REF!>$Y$3,0,#REF!)","v":{"$error":"#REF!"}},{"$f":"IF(#REF!>$Y$3,0,#REF!)","v":{"$error":"#REF!"}},{"$f":"IF(#REF!>$Y$3,0,#REF!)","v":{"$error":"#REF!"}},{"$f":"IF(#REF!>$Y$3,0,#REF!)","v":{"$error":"#REF!"}},{"$f":"IF(#REF!>$Y$3,0,#REF!)","v":{"$error":"#REF!"}},{"$f":"IF(#REF!>$Y$3,0,#REF!)","v":{"$error":"#REF!"}},{"$f":"IF(#REF!>$Y$3,0,#REF!)","v":{"$error":"#REF!"}},{"$f":"IF(#REF!>$Y$3,0,#REF!)","v":{"$error":"#REF!"}},{"$f":"IF(#REF!>$Y$3,0,#REF!)","v":{"$error":"#REF!"}},{"$f":"IF(#REF!>$Y$3,0,#REF!)","v":{"$error":"#REF!"}},{"$f":"IF(#REF!>$Y$3,0,#REF!)","v":{"$error":"#REF!"}},{"$f":"IF(#REF!>$Y$3,0,#REF!)","v":{"$error":"#REF!"}},{"$f":"IF(#REF!>$Y$3,0,#REF!)","v":{"$error":"#REF!"}},{"$f":"IF(#REF!>$Y$3,0,#REF!)","v":{"$error":"#REF!"}},{"$f":"IF(#REF!>$Y$3,0,#REF!)","v":{"$error":"#REF!"}},{"$f":"IF(#REF!>$Y$3,0,#REF!)","v":{"$error":"#REF!"}},{"$f":"IF(#REF!>$Y$3,0,#REF!)","v":{"$error":"#REF!"}},{"$f":"IF(#REF!>$Y$3,0,#REF!)","v":{"$error":"#REF!"}},{"$f":"IF(#REF!>$Y$3,0,#REF!)","v":{"$error":"#REF!"}},{"$f":"IF(#REF!>$Y$3,0,#REF!)","v":{"$error":"#REF!"}},{"$f":"IF(#REF!>$Y$3,0,#REF!)","v":{"$error":"#REF!"}},{"$f":"IF(#REF!>$Y$3,0,#REF!)","v":{"$error":"#REF!"}},{"$f":"IF(#REF!>$Y$3,0,#REF!)","v":{"$error":"#REF!"}}]
[null,null,9,null,null,null,null,null,null,null,null,null,null,null,null,null,null,null,null,null,null,null,null,null,null,null,null,null,null,null,null,null,null,null,null,null,null,null,null,null,null,null,null,null,null,null,null,null,null,null,null,null,null,null,null,null,null,0,{"$f":"IF(PARCIAL1!L$8=0,0,(ROUND(((BF13*10)/PARCIAL1!L$8),1)))","v":0},null,null,0,0,0,0,0,0,0,0,0,0,0,0,0,0,0,0,0,0,0,0,0,0,0,0,0,0,0,0,0,0,0,0,0,0,0,0,0,0,0,0,0,0,0,0,0,0,0,0,0,0,0,0,{"$f":"IF(#REF!>$Y$3,0,#REF!)","v":{"$error":"#REF!"}},{"$f":"IF(#REF!>$Y$3,0,#REF!)","v":{"$error":"#REF!"}},{"$f":"IF(#REF!>$Y$3,0,#REF!)","v":{"$error":"#REF!"}},{"$f":"IF(#REF!>$Y$3,0,#REF!)","v":{"$error":"#REF!"}},{"$f":"IF(#REF!>$Y$3,0,#REF!)","v":{"$error":"#REF!"}},{"$f":"IF(#REF!>$Y$3,0,#REF!)","v":{"$error":"#REF!"}},{"$f":"IF(#REF!>$Y$3,0,#REF!)","v":{"$error":"#REF!"}},{"$f":"IF(#REF!>$Y$3,0,#REF!)","v":{"$error":"#REF!"}},{"$f":"IF(#REF!>$Y$3,0,#REF!)","v":{"$error":"#REF!"}},{"$f":"IF(#REF!>$Y$3,0,#REF!)","v":{"$error":"#REF!"}},{"$f":"IF(#REF!>$Y$3,0,#REF!)","v":{"$error":"#REF!"}},{"$f":"IF(#REF!>$Y$3,0,#REF!)","v":{"$error":"#REF!"}},{"$f":"IF(#REF!>$Y$3,0,#REF!)","v":{"$error":"#REF!"}},{"$f":"IF(#REF!>$Y$3,0,#REF!)","v":{"$error":"#REF!"}},{"$f":"IF(#REF!>$Y$3,0,#REF!)","v":{"$error":"#REF!"}},{"$f":"IF(#REF!>$Y$3,0,#REF!)","v":{"$error":"#REF!"}},{"$f":"IF(#REF!>$Y$3,0,#REF!)","v":{"$error":"#REF!"}},{"$f":"IF(#REF!>$Y$3,0,#REF!)","v":{"$error":"#REF!"}},{"$f":"IF(#REF!>$Y$3,0,#REF!)","v":{"$error":"#REF!"}},{"$f":"IF(#REF!>$Y$3,0,#REF!)","v":{"$error":"#REF!"}},{"$f":"IF(#REF!>$Y$3,0,#REF!)","v":{"$error":"#REF!"}},{"$f":"IF(#REF!>$Y$3,0,#REF!)","v":{"$error":"#REF!"}},{"$f":"IF(#REF!>$Y$3,0,#REF!)","v":{"$error":"#REF!"}},{"$f":"IF(#REF!>$Y$3,0,#REF!)","v":{"$error":"#REF!"}},{"$f":"IF(#REF!>$Y$3,0,#REF!)","v":{"$error":"#REF!"}},{"$f":"IF(#REF!>$Y$3,0,#REF!)","v":{"$error":"#REF!"}},{"$f":"IF(#REF!>$Y$3,0,#REF!)","v":{"$error":"#REF!"}},{"$f":"IF(#REF!>$Y$3,0,#REF!)","v":{"$error":"#REF!"}}]
[null,null,10,null,null,null,null,null,null,null,null,null,null,null,null,null,null,null,null,null,null,null,null,null,null,null,null,null,null,null,null,null,null,null,null,null,null,null,null,null,null,null,null,null,null,null,null,null,null,null,null,null,null,null,null,null,null,0,{"$f":"IF(PARCIAL1!L$8=0,0,(ROUND(((BF14*10)/PARCIAL1!L$8),1)))","v":0},null,null,0,0,0,0,0,0,0,0,0,0,0,0,0,0,0,0,0,0,0,0,0,0,0,0,0,0,0,0,0,0,0,0,0,0,0,0,0,0,0,0,0,0,0,0,0,0,0,0,0,0,0,0,{"$f":"IF(#REF!>$Y$3,0,#REF!)","v":{"$error":"#REF!"}},{"$f":"IF(#REF!>$Y$3,0,#REF!)","v":{"$error":"#REF!"}},{"$f":"IF(#REF!>$Y$3,0,#REF!)","v":{"$error":"#REF!"}},{"$f":"IF(#REF!>$Y$3,0,#REF!)","v":{"$error":"#REF!"}},{"$f":"IF(#REF!>$Y$3,0,#REF!)","v":{"$error":"#REF!"}},{"$f":"IF(#REF!>$Y$3,0,#REF!)","v":{"$error":"#REF!"}},{"$f":"IF(#REF!>$Y$3,0,#REF!)","v":{"$error":"#REF!"}},{"$f":"IF(#REF!>$Y$3,0,#REF!)","v":{"$error":"#REF!"}},{"$f":"IF(#REF!>$Y$3,0,#REF!)","v":{"$error":"#REF!"}},{"$f":"IF(#REF!>$Y$3,0,#REF!)","v":{"$error":"#REF!"}},{"$f":"IF(#REF!>$Y$3,0,#REF!)","v":{"$error":"#REF!"}},{"$f":"IF(#REF!>$Y$3,0,#REF!)","v":{"$error":"#REF!"}},{"$f":"IF(#REF!>$Y$3,0,#REF!)","v":{"$error":"#REF!"}},{"$f":"IF(#REF!>$Y$3,0,#REF!)","v":{"$error":"#REF!"}},{"$f":"IF(#REF!>$Y$3,0,#REF!)","v":{"$error":"#REF!"}},{"$f":"IF(#REF!>$Y$3,0,#REF!)","v":{"$error":"#REF!"}},{"$f":"IF(#REF!>$Y$3,0,#REF!)","v":{"$error":"#REF!"}},{"$f":"IF(#REF!>$Y$3,0,#REF!)","v":{"$error":"#REF!"}},{"$f":"IF(#REF!>$Y$3,0,#REF!)","v":{"$error":"#REF!"}},{"$f":"IF(#REF!>$Y$3,0,#REF!)","v":{"$error":"#REF!"}},{"$f":"IF(#REF!>$Y$3,0,#REF!)","v":{"$error":"#REF!"}},{"$f":"IF(#REF!>$Y$3,0,#REF!)","v":{"$error":"#REF!"}},{"$f":"IF(#REF!>$Y$3,0,#REF!)","v":{"$error":"#REF!"}},{"$f":"IF(#REF!>$Y$3,0,#REF!)","v":{"$error":"#REF!"}},{"$f":"IF(#REF!>$Y$3,0,#REF!)","v":{"$error":"#REF!"}},{"$f":"IF(#REF!>$Y$3,0,#REF!)","v":{"$error":"#REF!"}},{"$f":"IF(#REF!>$Y$3,0,#REF!)","v":{"$error":"#REF!"}},{"$f":"IF(#REF!>$Y$3,0,#REF!)","v":{"$error":"#REF!"}}]
[null,null,11,null,null,null,null,null,null,null,null,null,null,null,null,null,null,null,null,null,null,null,null,null,null,null,null,null,null,null,null,null,null,null,null,null,null,null,null,null,null,null,null,null,null,null,null,null,null,null,null,null,null,null,null,null,null,0,{"$f":"IF(PARCIAL1!L$8=0,0,(ROUND(((BF15*10)/PARCIAL1!L$8),1)))","v":0},null,null,0,0,0,0,0,0,0,0,0,0,0,0,0,0,0,0,0,0,0,0,0,0,0,0,0,0,0,0,0,0,0,0,0,0,0,0,0,0,0,0,0,0,0,0,0,0,0,0,0,0,0,0,{"$f":"IF(#REF!>$Y$3,0,#REF!)","v":{"$error":"#REF!"}},{"$f":"IF(#REF!>$Y$3,0,#REF!)","v":{"$error":"#REF!"}},{"$f":"IF(#REF!>$Y$3,0,#REF!)","v":{"$error":"#REF!"}},{"$f":"IF(#REF!>$Y$3,0,#REF!)","v":{"$error":"#REF!"}},{"$f":"IF(#REF!>$Y$3,0,#REF!)","v":{"$error":"#REF!"}},{"$f":"IF(#REF!>$Y$3,0,#REF!)","v":{"$error":"#REF!"}},{"$f":"IF(#REF!>$Y$3,0,#REF!)","v":{"$error":"#REF!"}},{"$f":"IF(#REF!>$Y$3,0,#REF!)","v":{"$error":"#REF!"}},{"$f":"IF(#REF!>$Y$3,0,#REF!)","v":{"$error":"#REF!"}},{"$f":"IF(#REF!>$Y$3,0,#REF!)","v":{"$error":"#REF!"}},{"$f":"IF(#REF!>$Y$3,0,#REF!)","v":{"$error":"#REF!"}},{"$f":"IF(#REF!>$Y$3,0,#REF!)","v":{"$error":"#REF!"}},{"$f":"IF(#REF!>$Y$3,0,#REF!)","v":{"$error":"#REF!"}},{"$f":"IF(#REF!>$Y$3,0,#REF!)","v":{"$error":"#REF!"}},{"$f":"IF(#REF!>$Y$3,0,#REF!)","v":{"$error":"#REF!"}},{"$f":"IF(#REF!>$Y$3,0,#REF!)","v":{"$error":"#REF!"}},{"$f":"IF(#REF!>$Y$3,0,#REF!)","v":{"$error":"#REF!"}},{"$f":"IF(#REF!>$Y$3,0,#REF!)","v":{"$error":"#REF!"}},{"$f":"IF(#REF!>$Y$3,0,#REF!)","v":{"$error":"#REF!"}},{"$f":"IF(#REF!>$Y$3,0,#REF!)","v":{"$error":"#REF!"}},{"$f":"IF(#REF!>$Y$3,0,#REF!)","v":{"$error":"#REF!"}},{"$f":"IF(#REF!>$Y$3,0,#REF!)","v":{"$error":"#REF!"}},{"$f":"IF(#REF!>$Y$3,0,#REF!)","v":{"$error":"#REF!"}},{"$f":"IF(#REF!>$Y$3,0,#REF!)","v":{"$error":"#REF!"}},{"$f":"IF(#REF!>$Y$3,0,#REF!)","v":{"$error":"#REF!"}},{"$f":"IF(#REF!>$Y$3,0,#REF!)","v":{"$error":"#REF!"}},{"$f":"IF(#REF!>$Y$3,0,#REF!)","v":{"$error":"#REF!"}},{"$f":"IF(#REF!>$Y$3,0,#REF!)","v":{"$error":"#REF!"}}]
[null,null,12,null,null,null,null,null,null,null,null,null,null,null,null,null,null,null,null,null,null,null,null,null,null,null,null,null,null,null,null,null,null,null,null,null,null,null,null,null,null,null,null,null,null,null,null,null,null,null,null,null,null,null,null,null,null,0,{"$f":"IF(PARCIAL1!L$8=0,0,(ROUND(((BF16*10)/PARCIAL1!L$8),1)))","v":0},null,null,0,0,0,0,0,0,0,0,0,0,0,0,0,0,0,0,0,0,0,0,0,0,0,0,0,0,0,0,0,0,0,0,0,0,0,0,0,0,0,0,0,0,0,0,0,0,0,0,0,0,0,0,{"$f":"IF(#REF!>$Y$3,0,#REF!)","v":{"$error":"#REF!"}},{"$f":"IF(#REF!>$Y$3,0,#REF!)","v":{"$error":"#REF!"}},{"$f":"IF(#REF!>$Y$3,0,#REF!)","v":{"$error":"#REF!"}},{"$f":"IF(#REF!>$Y$3,0,#REF!)","v":{"$error":"#REF!"}},{"$f":"IF(#REF!>$Y$3,0,#REF!)","v":{"$error":"#REF!"}},{"$f":"IF(#REF!>$Y$3,0,#REF!)","v":{"$error":"#REF!"}},{"$f":"IF(#REF!>$Y$3,0,#REF!)","v":{"$error":"#REF!"}},{"$f":"IF(#REF!>$Y$3,0,#REF!)","v":{"$error":"#REF!"}},{"$f":"IF(#REF!>$Y$3,0,#REF!)","v":{"$error":"#REF!"}},{"$f":"IF(#REF!>$Y$3,0,#REF!)","v":{"$error":"#REF!"}},{"$f":"IF(#REF!>$Y$3,0,#REF!)","v":{"$error":"#REF!"}},{"$f":"IF(#REF!>$Y$3,0,#REF!)","v":{"$error":"#REF!"}},{"$f":"IF(#REF!>$Y$3,0,#REF!)","v":{"$error":"#REF!"}},{"$f":"IF(#REF!>$Y$3,0,#REF!)","v":{"$error":"#REF!"}},{"$f":"IF(#REF!>$Y$3,0,#REF!)","v":{"$error":"#REF!"}},{"$f":"IF(#REF!>$Y$3,0,#REF!)","v":{"$error":"#REF!"}},{"$f":"IF(#REF!>$Y$3,0,#REF!)","v":{"$error":"#REF!"}},{"$f":"IF(#REF!>$Y$3,0,#REF!)","v":{"$error":"#REF!"}},{"$f":"IF(#REF!>$Y$3,0,#REF!)","v":{"$error":"#REF!"}},{"$f":"IF(#REF!>$Y$3,0,#REF!)","v":{"$error":"#REF!"}},{"$f":"IF(#REF!>$Y$3,0,#REF!)","v":{"$error":"#REF!"}},{"$f":"IF(#REF!>$Y$3,0,#REF!)","v":{"$error":"#REF!"}},{"$f":"IF(#REF!>$Y$3,0,#REF!)","v":{"$error":"#REF!"}},{"$f":"IF(#REF!>$Y$3,0,#REF!)","v":{"$error":"#REF!"}},{"$f":"IF(#REF!>$Y$3,0,#REF!)","v":{"$error":"#REF!"}},{"$f":"IF(#REF!>$Y$3,0,#REF!)","v":{"$error":"#REF!"}},{"$f":"IF(#REF!>$Y$3,0,#REF!)","v":{"$error":"#REF!"}},{"$f":"IF(#REF!>$Y$3,0,#REF!)","v":{"$error":"#REF!"}}]
[null,null,13,null,null,null,null,null,null,null,null,null,null,null,null,null,null,null,null,null,null,null,null,null,null,null,null,null,null,null,null,null,null,null,null,null,null,null,null,null,null,null,null,null,null,null,null,null,null,null,null,null,null,null,null,null,null,0,{"$f":"IF(PARCIAL1!L$8=0,0,(ROUND(((BF17*10)/PARCIAL1!L$8),1)))","v":0},null,null,0,0,0,0,0,0,0,0,0,0,0,0,0,0,0,0,0,0,0,0,0,0,0,0,0,0,0,0,0,0,0,0,0,0,0,0,0,0,0,0,0,0,0,0,0,0,0,0,0,0,0,0,{"$f":"IF(#REF!>$Y$3,0,#REF!)","v":{"$error":"#REF!"}},{"$f":"IF(#REF!>$Y$3,0,#REF!)","v":{"$error":"#REF!"}},{"$f":"IF(#REF!>$Y$3,0,#REF!)","v":{"$error":"#REF!"}},{"$f":"IF(#REF!>$Y$3,0,#REF!)","v":{"$error":"#REF!"}},{"$f":"IF(#REF!>$Y$3,0,#REF!)","v":{"$error":"#REF!"}},{"$f":"IF(#REF!>$Y$3,0,#REF!)","v":{"$error":"#REF!"}},{"$f":"IF(#REF!>$Y$3,0,#REF!)","v":{"$error":"#REF!"}},{"$f":"IF(#REF!>$Y$3,0,#REF!)","v":{"$error":"#REF!"}},{"$f":"IF(#REF!>$Y$3,0,#REF!)","v":{"$error":"#REF!"}},{"$f":"IF(#REF!>$Y$3,0,#REF!)","v":{"$error":"#REF!"}},{"$f":"IF(#REF!>$Y$3,0,#REF!)","v":{"$error":"#REF!"}},{"$f":"IF(#REF!>$Y$3,0,#REF!)","v":{"$error":"#REF!"}},{"$f":"IF(#REF!>$Y$3,0,#REF!)","v":{"$error":"#REF!"}},{"$f":"IF(#REF!>$Y$3,0,#REF!)","v":{"$error":"#REF!"}},{"$f":"IF(#REF!>$Y$3,0,#REF!)","v":{"$error":"#REF!"}},{"$f":"IF(#REF!>$Y$3,0,#REF!)","v":{"$error":"#REF!"}},{"$f":"IF(#REF!>$Y$3,0,#REF!)","v":{"$error":"#REF!"}},{"$f":"IF(#REF!>$Y$3,0,#REF!)","v":{"$error":"#REF!"}},{"$f":"IF(#REF!>$Y$3,0,#REF!)","v":{"$error":"#REF!"}},{"$f":"IF(#REF!>$Y$3,0,#REF!)","v":{"$error":"#REF!"}},{"$f":"IF(#REF!>$Y$3,0,#REF!)","v":{"$error":"#REF!"}},{"$f":"IF(#REF!>$Y$3,0,#REF!)","v":{"$error":"#REF!"}},{"$f":"IF(#REF!>$Y$3,0,#REF!)","v":{"$error":"#REF!"}},{"$f":"IF(#REF!>$Y$3,0,#REF!)","v":{"$error":"#REF!"}},{"$f":"IF(#REF!>$Y$3,0,#REF!)","v":{"$error":"#REF!"}},{"$f":"IF(#REF!>$Y$3,0,#REF!)","v":{"$error":"#REF!"}},{"$f":"IF(#REF!>$Y$3,0,#REF!)","v":{"$error":"#REF!"}},{"$f":"IF(#REF!>$Y$3,0,#REF!)","v":{"$error":"#REF!"}}]
[null,null,14,null,null,null,null,null,null,null,null,null,null,null,null,null,null,null,null,null,null,null,null,null,null,null,null,null,null,null,null,null,null,null,null,null,null,null,null,null,null,null,null,null,null,null,null,null,null,null,null,null,null,null,null,null,null,0,{"$f":"IF(PARCIAL1!L$8=0,0,(ROUND(((BF18*10)/PARCIAL1!L$8),1)))","v":0},null,null,0,0,0,0,0,0,0,0,0,0,0,0,0,0,0,0,0,0,0,0,0,0,0,0,0,0,0,0,0,0,0,0,0,0,0,0,0,0,0,0,0,0,0,0,0,0,0,0,0,0,0,0,{"$f":"IF(#REF!>$Y$3,0,#REF!)","v":{"$error":"#REF!"}},{"$f":"IF(#REF!>$Y$3,0,#REF!)","v":{"$error":"#REF!"}},{"$f":"IF(#REF!>$Y$3,0,#REF!)","v":{"$error":"#REF!"}},{"$f":"IF(#REF!>$Y$3,0,#REF!)","v":{"$error":"#REF!"}},{"$f":"IF(#REF!>$Y$3,0,#REF!)","v":{"$error":"#REF!"}},{"$f":"IF(#REF!>$Y$3,0,#REF!)","v":{"$error":"#REF!"}},{"$f":"IF(#REF!>$Y$3,0,#REF!)","v":{"$error":"#REF!"}},{"$f":"IF(#REF!>$Y$3,0,#REF!)","v":{"$error":"#REF!"}},{"$f":"IF(#REF!>$Y$3,0,#REF!)","v":{"$error":"#REF!"}},{"$f":"IF(#REF!>$Y$3,0,#REF!)","v":{"$error":"#REF!"}},{"$f":"IF(#REF!>$Y$3,0,#REF!)","v":{"$error":"#REF!"}},{"$f":"IF(#REF!>$Y$3,0,#REF!)","v":{"$error":"#REF!"}},{"$f":"IF(#REF!>$Y$3,0,#REF!)","v":{"$error":"#REF!"}},{"$f":"IF(#REF!>$Y$3,0,#REF!)","v":{"$error":"#REF!"}},{"$f":"IF(#REF!>$Y$3,0,#REF!)","v":{"$error":"#REF!"}},{"$f":"IF(#REF!>$Y$3,0,#REF!)","v":{"$error":"#REF!"}},{"$f":"IF(#REF!>$Y$3,0,#REF!)","v":{"$error":"#REF!"}},{"$f":"IF(#REF!>$Y$3,0,#REF!)","v":{"$error":"#REF!"}},{"$f":"IF(#REF!>$Y$3,0,#REF!)","v":{"$error":"#REF!"}},{"$f":"IF(#REF!>$Y$3,0,#REF!)","v":{"$error":"#REF!"}},{"$f":"IF(#REF!>$Y$3,0,#REF!)","v":{"$error":"#REF!"}},{"$f":"IF(#REF!>$Y$3,0,#REF!)","v":{"$error":"#REF!"}},{"$f":"IF(#REF!>$Y$3,0,#REF!)","v":{"$error":"#REF!"}},{"$f":"IF(#REF!>$Y$3,0,#REF!)","v":{"$error":"#REF!"}},{"$f":"IF(#REF!>$Y$3,0,#REF!)","v":{"$error":"#REF!"}},{"$f":"IF(#REF!>$Y$3,0,#REF!)","v":{"$error":"#REF!"}},{"$f":"IF(#REF!>$Y$3,0,#REF!)","v":{"$error":"#REF!"}},{"$f":"IF(#REF!>$Y$3,0,#REF!)","v":{"$error":"#REF!"}}]
[null,null,15,null,null,null,null,null,null,null,null,null,null,null,null,null,null,null,null,null,null,null,null,null,null,null,null,null,null,null,null,null,null,null,null,null,null,null,null,null,null,null,null,null,null,null,null,null,null,null,null,null,null,null,null,null,null,0,{"$f":"IF(PARCIAL1!L$8=0,0,(ROUND(((BF19*10)/PARCIAL1!L$8),1)))","v":0},null,null,0,0,0,0,0,0,0,0,0,0,0,0,0,0,0,0,0,0,0,0,0,0,0,0,0,0,0,0,0,0,0,0,0,0,0,0,0,0,0,0,0,0,0,0,0,0,0,0,0,0,0,0,{"$f":"IF(#REF!>$Y$3,0,#REF!)","v":{"$error":"#REF!"}},{"$f":"IF(#REF!>$Y$3,0,#REF!)","v":{"$error":"#REF!"}},{"$f":"IF(#REF!>$Y$3,0,#REF!)","v":{"$error":"#REF!"}},{"$f":"IF(#REF!>$Y$3,0,#REF!)","v":{"$error":"#REF!"}},{"$f":"IF(#REF!>$Y$3,0,#REF!)","v":{"$error":"#REF!"}},{"$f":"IF(#REF!>$Y$3,0,#REF!)","v":{"$error":"#REF!"}},{"$f":"IF(#REF!>$Y$3,0,#REF!)","v":{"$error":"#REF!"}},{"$f":"IF(#REF!>$Y$3,0,#REF!)","v":{"$error":"#REF!"}},{"$f":"IF(#REF!>$Y$3,0,#REF!)","v":{"$error":"#REF!"}},{"$f":"IF(#REF!>$Y$3,0,#REF!)","v":{"$error":"#REF!"}},{"$f":"IF(#REF!>$Y$3,0,#REF!)","v":{"$error":"#REF!"}},{"$f":"IF(#REF!>$Y$3,0,#REF!)","v":{"$error":"#REF!"}},{"$f":"IF(#REF!>$Y$3,0,#REF!)","v":{"$error":"#REF!"}},{"$f":"IF(#REF!>$Y$3,0,#REF!)","v":{"$error":"#REF!"}},{"$f":"IF(#REF!>$Y$3,0,#REF!)","v":{"$error":"#REF!"}},{"$f":"IF(#REF!>$Y$3,0,#REF!)","v":{"$error":"#REF!"}},{"$f":"IF(#REF!>$Y$3,0,#REF!)","v":{"$error":"#REF!"}},{"$f":"IF(#REF!>$Y$3,0,#REF!)","v":{"$error":"#REF!"}},{"$f":"IF(#REF!>$Y$3,0,#REF!)","v":{"$error":"#REF!"}},{"$f":"IF(#REF!>$Y$3,0,#REF!)","v":{"$error":"#REF!"}},{"$f":"IF(#REF!>$Y$3,0,#REF!)","v":{"$error":"#REF!"}},{"$f":"IF(#REF!>$Y$3,0,#REF!)","v":{"$error":"#REF!"}},{"$f":"IF(#REF!>$Y$3,0,#REF!)","v":{"$error":"#REF!"}},{"$f":"IF(#REF!>$Y$3,0,#REF!)","v":{"$error":"#REF!"}},{"$f":"IF(#REF!>$Y$3,0,#REF!)","v":{"$error":"#REF!"}},{"$f":"IF(#REF!>$Y$3,0,#REF!)","v":{"$error":"#REF!"}},{"$f":"IF(#REF!>$Y$3,0,#REF!)","v":{"$error":"#REF!"}},{"$f":"IF(#REF!>$Y$3,0,#REF!)","v":{"$error":"#REF!"}}]
[null,null,16,null,null,null,null,null,null,null,null,null,null,null,null,null,null,null,null,null,null,null,null,null,null,null,null,null,null,null,null,null,null,null,null,null,null,null,null,null,null,null,null,null,null,null,null,null,null,null,null,null,null,null,null,null,null,0,{"$f":"IF(PARCIAL1!L$8=0,0,(ROUND(((BF20*10)/PARCIAL1!L$8),1)))","v":0},null,null,0,0,0,0,0,0,0,0,0,0,0,0,0,0,0,0,0,0,0,0,0,0,0,0,0,0,0,0,0,0,0,0,0,0,0,0,0,0,0,0,0,0,0,0,0,0,0,0,0,0,0,0,{"$f":"IF(#REF!>$Y$3,0,#REF!)","v":{"$error":"#REF!"}},{"$f":"IF(#REF!>$Y$3,0,#REF!)","v":{"$error":"#REF!"}},{"$f":"IF(#REF!>$Y$3,0,#REF!)","v":{"$error":"#REF!"}},{"$f":"IF(#REF!>$Y$3,0,#REF!)","v":{"$error":"#REF!"}},{"$f":"IF(#REF!>$Y$3,0,#REF!)","v":{"$error":"#REF!"}},{"$f":"IF(#REF!>$Y$3,0,#REF!)","v":{"$error":"#REF!"}},{"$f":"IF(#REF!>$Y$3,0,#REF!)","v":{"$error":"#REF!"}},{"$f":"IF(#REF!>$Y$3,0,#REF!)","v":{"$error":"#REF!"}},{"$f":"IF(#REF!>$Y$3,0,#REF!)","v":{"$error":"#REF!"}},{"$f":"IF(#REF!>$Y$3,0,#REF!)","v":{"$error":"#REF!"}},{"$f":"IF(#REF!>$Y$3,0,#REF!)","v":{"$error":"#REF!"}},{"$f":"IF(#REF!>$Y$3,0,#REF!)","v":{"$error":"#REF!"}},{"$f":"IF(#REF!>$Y$3,0,#REF!)","v":{"$error":"#REF!"}},{"$f":"IF(#REF!>$Y$3,0,#REF!)","v":{"$error":"#REF!"}},{"$f":"IF(#REF!>$Y$3,0,#REF!)","v":{"$error":"#REF!"}},{"$f":"IF(#REF!>$Y$3,0,#REF!)","v":{"$error":"#REF!"}},{"$f":"IF(#REF!>$Y$3,0,#REF!)","v":{"$error":"#REF!"}},{"$f":"IF(#REF!>$Y$3,0,#REF!)","v":{"$error":"#REF!"}},{"$f":"IF(#REF!>$Y$3,0,#REF!)","v":{"$error":"#REF!"}},{"$f":"IF(#REF!>$Y$3,0,#REF!)","v":{"$error":"#REF!"}},{"$f":"IF(#REF!>$Y$3,0,#REF!)","v":{"$error":"#REF!"}},{"$f":"IF(#REF!>$Y$3,0,#REF!)","v":{"$error":"#REF!"}},{"$f":"IF(#REF!>$Y$3,0,#REF!)","v":{"$error":"#REF!"}},{"$f":"IF(#REF!>$Y$3,0,#REF!)","v":{"$error":"#REF!"}},{"$f":"IF(#REF!>$Y$3,0,#REF!)","v":{"$error":"#REF!"}},{"$f":"IF(#REF!>$Y$3,0,#REF!)","v":{"$error":"#REF!"}},{"$f":"IF(#REF!>$Y$3,0,#REF!)","v":{"$error":"#REF!"}},{"$f":"IF(#REF!>$Y$3,0,#REF!)","v":{"$error":"#REF!"}}]
[null,null,17,null,null,null,null,null,null,null,null,null,null,null,null,null,null,null,null,null,null,null,null,null,null,null,null,null,null,null,null,null,null,null,null,null,null,null,null,null,null,null,null,null,null,null,null,null,null,null,null,null,null,null,null,null,null,0,{"$f":"IF(PARCIAL1!L$8=0,0,(ROUND(((BF21*10)/PARCIAL1!L$8),1)))","v":0},null,null,0,0,0,0,0,0,0,0,0,0,0,0,0,0,0,0,0,0,0,0,0,0,0,0,0,0,0,0,0,0,0,0,0,0,0,0,0,0,0,0,0,0,0,0,0,0,0,0,0,0,0,0,{"$f":"IF(#REF!>$Y$3,0,#REF!)","v":{"$error":"#REF!"}},{"$f":"IF(#REF!>$Y$3,0,#REF!)","v":{"$error":"#REF!"}},{"$f":"IF(#REF!>$Y$3,0,#REF!)","v":{"$error":"#REF!"}},{"$f":"IF(#REF!>$Y$3,0,#REF!)","v":{"$error":"#REF!"}},{"$f":"IF(#REF!>$Y$3,0,#REF!)","v":{"$error":"#REF!"}},{"$f":"IF(#REF!>$Y$3,0,#REF!)","v":{"$error":"#REF!"}},{"$f":"IF(#REF!>$Y$3,0,#REF!)","v":{"$error":"#REF!"}},{"$f":"IF(#REF!>$Y$3,0,#REF!)","v":{"$error":"#REF!"}},{"$f":"IF(#REF!>$Y$3,0,#REF!)","v":{"$error":"#REF!"}},{"$f":"IF(#REF!>$Y$3,0,#REF!)","v":{"$error":"#REF!"}},{"$f":"IF(#REF!>$Y$3,0,#REF!)","v":{"$error":"#REF!"}},{"$f":"IF(#REF!>$Y$3,0,#REF!)","v":{"$error":"#REF!"}},{"$f":"IF(#REF!>$Y$3,0,#REF!)","v":{"$error":"#REF!"}},{"$f":"IF(#REF!>$Y$3,0,#REF!)","v":{"$error":"#REF!"}},{"$f":"IF(#REF!>$Y$3,0,#REF!)","v":{"$error":"#REF!"}},{"$f":"IF(#REF!>$Y$3,0,#REF!)","v":{"$error":"#REF!"}},{"$f":"IF(#REF!>$Y$3,0,#REF!)","v":{"$error":"#REF!"}},{"$f":"IF(#REF!>$Y$3,0,#REF!)","v":{"$error":"#REF!"}},{"$f":"IF(#REF!>$Y$3,0,#REF!)","v":{"$error":"#REF!"}},{"$f":"IF(#REF!>$Y$3,0,#REF!)","v":{"$error":"#REF!"}},{"$f":"IF(#REF!>$Y$3,0,#REF!)","v":{"$error":"#REF!"}},{"$f":"IF(#REF!>$Y$3,0,#REF!)","v":{"$error":"#REF!"}},{"$f":"IF(#REF!>$Y$3,0,#REF!)","v":{"$error":"#REF!"}},{"$f":"IF(#REF!>$Y$3,0,#REF!)","v":{"$error":"#REF!"}},{"$f":"IF(#REF!>$Y$3,0,#REF!)","v":{"$error":"#REF!"}},{"$f":"IF(#REF!>$Y$3,0,#REF!)","v":{"$error":"#REF!"}},{"$f":"IF(#REF!>$Y$3,0,#REF!)","v":{"$error":"#REF!"}},{"$f":"IF(#REF!>$Y$3,0,#REF!)","v":{"$error":"#REF!"}}]
[null,null,18,null,null,null,null,null,null,null,null,null,null,null,null,null,null,null,null,null,null,null,null,null,null,null,null,null,null,null,null,null,null,null,null,null,null,null,null,null,null,null,null,null,null,null,null,null,null,null,null,null,null,null,null,null,null,0,{"$f":"IF(PARCIAL1!L$8=0,0,(ROUND(((BF22*10)/PARCIAL1!L$8),1)))","v":0},null,null,0,0,0,0,0,0,0,0,0,0,0,0,0,0,0,0,0,0,0,0,0,0,0,0,0,0,0,0,0,0,0,0,0,0,0,0,0,0,0,0,0,0,0,0,0,0,0,0,0,0,0,0,{"$f":"IF(#REF!>$Y$3,0,#REF!)","v":{"$error":"#REF!"}},{"$f":"IF(#REF!>$Y$3,0,#REF!)","v":{"$error":"#REF!"}},{"$f":"IF(#REF!>$Y$3,0,#REF!)","v":{"$error":"#REF!"}},{"$f":"IF(#REF!>$Y$3,0,#REF!)","v":{"$error":"#REF!"}},{"$f":"IF(#REF!>$Y$3,0,#REF!)","v":{"$error":"#REF!"}},{"$f":"IF(#REF!>$Y$3,0,#REF!)","v":{"$error":"#REF!"}},{"$f":"IF(#REF!>$Y$3,0,#REF!)","v":{"$error":"#REF!"}},{"$f":"IF(#REF!>$Y$3,0,#REF!)","v":{"$error":"#REF!"}},{"$f":"IF(#REF!>$Y$3,0,#REF!)","v":{"$error":"#REF!"}},{"$f":"IF(#REF!>$Y$3,0,#REF!)","v":{"$error":"#REF!"}},{"$f":"IF(#REF!>$Y$3,0,#REF!)","v":{"$error":"#REF!"}},{"$f":"IF(#REF!>$Y$3,0,#REF!)","v":{"$error":"#REF!"}},{"$f":"IF(#REF!>$Y$3,0,#REF!)","v":{"$error":"#REF!"}},{"$f":"IF(#REF!>$Y$3,0,#REF!)","v":{"$error":"#REF!"}},{"$f":"IF(#REF!>$Y$3,0,#REF!)","v":{"$error":"#REF!"}},{"$f":"IF(#REF!>$Y$3,0,#REF!)","v":{"$error":"#REF!"}},{"$f":"IF(#REF!>$Y$3,0,#REF!)","v":{"$error":"#REF!"}},{"$f":"IF(#REF!>$Y$3,0,#REF!)","v":{"$error":"#REF!"}},{"$f":"IF(#REF!>$Y$3,0,#REF!)","v":{"$error":"#REF!"}},{"$f":"IF(#REF!>$Y$3,0,#REF!)","v":{"$error":"#REF!"}},{"$f":"IF(#REF!>$Y$3,0,#REF!)","v":{"$error":"#REF!"}},{"$f":"IF(#REF!>$Y$3,0,#REF!)","v":{"$error":"#REF!"}},{"$f":"IF(#REF!>$Y$3,0,#REF!)","v":{"$error":"#REF!"}},{"$f":"IF(#REF!>$Y$3,0,#REF!)","v":{"$error":"#REF!"}},{"$f":"IF(#REF!>$Y$3,0,#REF!)","v":{"$error":"#REF!"}},{"$f":"IF(#REF!>$Y$3,0,#REF!)","v":{"$error":"#REF!"}},{"$f":"IF(#REF!>$Y$3,0,#REF!)","v":{"$error":"#REF!"}},{"$f":"IF(#REF!>$Y$3,0,#REF!)","v":{"$error":"#REF!"}}]
[null,null,19,null,null,null,null,null,null,null,null,null,null,null,null,null,null,null,null,null,null,null,null,null,null,null,null,null,null,null,null,null,null,null,null,null,null,null,null,null,null,null,null,null,null,null,null,null,null,null,null,null,null,null,null,null,null,0,{"$f":"IF(PARCIAL1!L$8=0,0,(ROUND(((BF23*10)/PARCIAL1!L$8),1)))","v":0},null,null,0,0,0,0,0,0,0,0,0,0,0,0,0,0,0,0,0,0,0,0,0,0,0,0,0,0,0,0,0,0,0,0,0,0,0,0,0,0,0,0,0,0,0,0,0,0,0,0,0,0,0,0,{"$f":"IF(#REF!>$Y$3,0,#REF!)","v":{"$error":"#REF!"}},{"$f":"IF(#REF!>$Y$3,0,#REF!)","v":{"$error":"#REF!"}},{"$f":"IF(#REF!>$Y$3,0,#REF!)","v":{"$error":"#REF!"}},{"$f":"IF(#REF!>$Y$3,0,#REF!)","v":{"$error":"#REF!"}},{"$f":"IF(#REF!>$Y$3,0,#REF!)","v":{"$error":"#REF!"}},{"$f":"IF(#REF!>$Y$3,0,#REF!)","v":{"$error":"#REF!"}},{"$f":"IF(#REF!>$Y$3,0,#REF!)","v":{"$error":"#REF!"}},{"$f":"IF(#REF!>$Y$3,0,#REF!)","v":{"$error":"#REF!"}},{"$f":"IF(#REF!>$Y$3,0,#REF!)","v":{"$error":"#REF!"}},{"$f":"IF(#REF!>$Y$3,0,#REF!)","v":{"$error":"#REF!"}},{"$f":"IF(#REF!>$Y$3,0,#REF!)","v":{"$error":"#REF!"}},{"$f":"IF(#REF!>$Y$3,0,#REF!)","v":{"$error":"#REF!"}},{"$f":"IF(#REF!>$Y$3,0,#REF!)","v":{"$error":"#REF!"}},{"$f":"IF(#REF!>$Y$3,0,#REF!)","v":{"$error":"#REF!"}},{"$f":"IF(#REF!>$Y$3,0,#REF!)","v":{"$error":"#REF!"}},{"$f":"IF(#REF!>$Y$3,0,#REF!)","v":{"$error":"#REF!"}},{"$f":"IF(#REF!>$Y$3,0,#REF!)","v":{"$error":"#REF!"}},{"$f":"IF(#REF!>$Y$3,0,#REF!)","v":{"$error":"#REF!"}},{"$f":"IF(#REF!>$Y$3,0,#REF!)","v":{"$error":"#REF!"}},{"$f":"IF(#REF!>$Y$3,0,#REF!)","v":{"$error":"#REF!"}},{"$f":"IF(#REF!>$Y$3,0,#REF!)","v":{"$error":"#REF!"}},{"$f":"IF(#REF!>$Y$3,0,#REF!)","v":{"$error":"#REF!"}},{"$f":"IF(#REF!>$Y$3,0,#REF!)","v":{"$error":"#REF!"}},{"$f":"IF(#REF!>$Y$3,0,#REF!)","v":{"$error":"#REF!"}},{"$f":"IF(#REF!>$Y$3,0,#REF!)","v":{"$error":"#REF!"}},{"$f":"IF(#REF!>$Y$3,0,#REF!)","v":{"$error":"#REF!"}},{"$f":"IF(#REF!>$Y$3,0,#REF!)","v":{"$error":"#REF!"}},{"$f":"IF(#REF!>$Y$3,0,#REF!)","v":{"$error":"#REF!"}}]
[null,null,20,null,null,null,null,null,null,null,null,null,null,null,null,null,null,null,null,null,null,null,null,null,null,null,null,null,null,null,null,null,null,null,null,null,null,null,null,null,null,null,null,null,null,null,null,null,null,null,null,null,null,null,null,null,null,0,{"$f":"IF(PARCIAL1!L$8=0,0,(ROUND(((BF24*10)/PARCIAL1!L$8),1)))","v":0},null,null,0,0,0,0,0,0,0,0,0,0,0,0,0,0,0,0,0,0,0,0,0,0,0,0,0,0,0,0,0,0,0,0,0,0,0,0,0,0,0,0,0,0,0,0,0,0,0,0,0,0,0,0,{"$f":"IF(#REF!>$Y$3,0,#REF!)","v":{"$error":"#REF!"}},{"$f":"IF(#REF!>$Y$3,0,#REF!)","v":{"$error":"#REF!"}},{"$f":"IF(#REF!>$Y$3,0,#REF!)","v":{"$error":"#REF!"}},{"$f":"IF(#REF!>$Y$3,0,#REF!)","v":{"$error":"#REF!"}},{"$f":"IF(#REF!>$Y$3,0,#REF!)","v":{"$error":"#REF!"}},{"$f":"IF(#REF!>$Y$3,0,#REF!)","v":{"$error":"#REF!"}},{"$f":"IF(#REF!>$Y$3,0,#REF!)","v":{"$error":"#REF!"}},{"$f":"IF(#REF!>$Y$3,0,#REF!)","v":{"$error":"#REF!"}},{"$f":"IF(#REF!>$Y$3,0,#REF!)","v":{"$error":"#REF!"}},{"$f":"IF(#REF!>$Y$3,0,#REF!)","v":{"$error":"#REF!"}},{"$f":"IF(#REF!>$Y$3,0,#REF!)","v":{"$error":"#REF!"}},{"$f":"IF(#REF!>$Y$3,0,#REF!)","v":{"$error":"#REF!"}},{"$f":"IF(#REF!>$Y$3,0,#REF!)","v":{"$error":"#REF!"}},{"$f":"IF(#REF!>$Y$3,0,#REF!)","v":{"$error":"#REF!"}},{"$f":"IF(#REF!>$Y$3,0,#REF!)","v":{"$error":"#REF!"}},{"$f":"IF(#REF!>$Y$3,0,#REF!)","v":{"$error":"#REF!"}},{"$f":"IF(#REF!>$Y$3,0,#REF!)","v":{"$error":"#REF!"}},{"$f":"IF(#REF!>$Y$3,0,#REF!)","v":{"$error":"#REF!"}},{"$f":"IF(#REF!>$Y$3,0,#REF!)","v":{"$error":"#REF!"}},{"$f":"IF(#REF!>$Y$3,0,#REF!)","v":{"$error":"#REF!"}},{"$f":"IF(#REF!>$Y$3,0,#REF!)","v":{"$error":"#REF!"}},{"$f":"IF(#REF!>$Y$3,0,#REF!)","v":{"$error":"#REF!"}},{"$f":"IF(#REF!>$Y$3,0,#REF!)","v":{"$error":"#REF!"}},{"$f":"IF(#REF!>$Y$3,0,#REF!)","v":{"$error":"#REF!"}},{"$f":"IF(#REF!>$Y$3,0,#REF!)","v":{"$error":"#REF!"}},{"$f":"IF(#REF!>$Y$3,0,#REF!)","v":{"$error":"#REF!"}},{"$f":"IF(#REF!>$Y$3,0,#REF!)","v":{"$error":"#REF!"}},{"$f":"IF(#REF!>$Y$3,0,#REF!)","v":{"$error":"#REF!"}}]
[null,null,21,null,null,null,null,null,null,null,null,null,null,null,null,null,null,null,null,null,null,null,null,null,null,null,null,null,null,null,null,null,null,null,null,null,null,null,null,null,null,null,null,null,null,null,null,null,null,null,null,null,null,null,null,null,null,0,{"$f":"IF(PARCIAL1!L$8=0,0,(ROUND(((BF25*10)/PARCIAL1!L$8),1)))","v":0},null,null,0,0,0,0,0,0,0,0,0,0,0,0,0,0,0,0,0,0,0,0,0,0,0,0,0,0,0,0,0,0,0,0,0,0,0,0,0,0,0,0,0,0,0,0,0,0,0,0,0,0,0,0,{"$f":"IF(#REF!>$Y$3,0,#REF!)","v":{"$error":"#REF!"}},{"$f":"IF(#REF!>$Y$3,0,#REF!)","v":{"$error":"#REF!"}},{"$f":"IF(#REF!>$Y$3,0,#REF!)","v":{"$error":"#REF!"}},{"$f":"IF(#REF!>$Y$3,0,#REF!)","v":{"$error":"#REF!"}},{"$f":"IF(#REF!>$Y$3,0,#REF!)","v":{"$error":"#REF!"}},{"$f":"IF(#REF!>$Y$3,0,#REF!)","v":{"$error":"#REF!"}},{"$f":"IF(#REF!>$Y$3,0,#REF!)","v":{"$error":"#REF!"}},{"$f":"IF(#REF!>$Y$3,0,#REF!)","v":{"$error":"#REF!"}},{"$f":"IF(#REF!>$Y$3,0,#REF!)","v":{"$error":"#REF!"}},{"$f":"IF(#REF!>$Y$3,0,#REF!)","v":{"$error":"#REF!"}},{"$f":"IF(#REF!>$Y$3,0,#REF!)","v":{"$error":"#REF!"}},{"$f":"IF(#REF!>$Y$3,0,#REF!)","v":{"$error":"#REF!"}},{"$f":"IF(#REF!>$Y$3,0,#REF!)","v":{"$error":"#REF!"}},{"$f":"IF(#REF!>$Y$3,0,#REF!)","v":{"$error":"#REF!"}},{"$f":"IF(#REF!>$Y$3,0,#REF!)","v":{"$error":"#REF!"}},{"$f":"IF(#REF!>$Y$3,0,#REF!)","v":{"$error":"#REF!"}},{"$f":"IF(#REF!>$Y$3,0,#REF!)","v":{"$error":"#REF!"}},{"$f":"IF(#REF!>$Y$3,0,#REF!)","v":{"$error":"#REF!"}},{"$f":"IF(#REF!>$Y$3,0,#REF!)","v":{"$error":"#REF!"}},{"$f":"IF(#REF!>$Y$3,0,#REF!)","v":{"$error":"#REF!"}},{"$f":"IF(#REF!>$Y$3,0,#REF!)","v":{"$error":"#REF!"}},{"$f":"IF(#REF!>$Y$3,0,#REF!)","v":{"$error":"#REF!"}},{"$f":"IF(#REF!>$Y$3,0,#REF!)","v":{"$error":"#REF!"}},{"$f":"IF(#REF!>$Y$3,0,#REF!)","v":{"$error":"#REF!"}},{"$f":"IF(#REF!>$Y$3,0,#REF!)","v":{"$error":"#REF!"}},{"$f":"IF(#REF!>$Y$3,0,#REF!)","v":{"$error":"#REF!"}},{"$f":"IF(#REF!>$Y$3,0,#REF!)","v":{"$error":"#REF!"}},{"$f":"IF(#REF!>$Y$3,0,#REF!)","v":{"$error":"#REF!"}}]
[null,null,22,null,null,null,null,null,null,null,null,null,null,null,null,null,null,null,null,null,null,null,null,null,null,null,null,null,null,null,null,null,null,null,null,null,null,null,null,null,null,null,null,null,null,null,null,null,null,null,null,null,null,null,null,null,null,0,{"$f":"IF(PARCIAL1!L$8=0,0,(ROUND(((BF26*10)/PARCIAL1!L$8),1)))","v":0},null,null,0,0,0,0,0,0,0,0,0,0,0,0,0,0,0,0,0,0,0,0,0,0,0,0,0,0,0,0,0,0,0,0,0,0,0,0,0,0,0,0,0,0,0,0,0,0,0,0,0,0,0,0,{"$f":"IF(#REF!>$Y$3,0,#REF!)","v":{"$error":"#REF!"}},{"$f":"IF(#REF!>$Y$3,0,#REF!)","v":{"$error":"#REF!"}},{"$f":"IF(#REF!>$Y$3,0,#REF!)","v":{"$error":"#REF!"}},{"$f":"IF(#REF!>$Y$3,0,#REF!)","v":{"$error":"#REF!"}},{"$f":"IF(#REF!>$Y$3,0,#REF!)","v":{"$error":"#REF!"}},{"$f":"IF(#REF!>$Y$3,0,#REF!)","v":{"$error":"#REF!"}},{"$f":"IF(#REF!>$Y$3,0,#REF!)","v":{"$error":"#REF!"}},{"$f":"IF(#REF!>$Y$3,0,#REF!)","v":{"$error":"#REF!"}},{"$f":"IF(#REF!>$Y$3,0,#REF!)","v":{"$error":"#REF!"}},{"$f":"IF(#REF!>$Y$3,0,#REF!)","v":{"$error":"#REF!"}},{"$f":"IF(#REF!>$Y$3,0,#REF!)","v":{"$error":"#REF!"}},{"$f":"IF(#REF!>$Y$3,0,#REF!)","v":{"$error":"#REF!"}},{"$f":"IF(#REF!>$Y$3,0,#REF!)","v":{"$error":"#REF!"}},{"$f":"IF(#REF!>$Y$3,0,#REF!)","v":{"$error":"#REF!"}},{"$f":"IF(#REF!>$Y$3,0,#REF!)","v":{"$error":"#REF!"}},{"$f":"IF(#REF!>$Y$3,0,#REF!)","v":{"$error":"#REF!"}},{"$f":"IF(#REF!>$Y$3,0,#REF!)","v":{"$error":"#REF!"}},{"$f":"IF(#REF!>$Y$3,0,#REF!)","v":{"$error":"#REF!"}},{"$f":"IF(#REF!>$Y$3,0,#REF!)","v":{"$error":"#REF!"}},{"$f":"IF(#REF!>$Y$3,0,#REF!)","v":{"$error":"#REF!"}},{"$f":"IF(#REF!>$Y$3,0,#REF!)","v":{"$error":"#REF!"}},{"$f":"IF(#REF!>$Y$3,0,#REF!)","v":{"$error":"#REF!"}},{"$f":"IF(#REF!>$Y$3,0,#REF!)","v":{"$error":"#REF!"}},{"$f":"IF(#REF!>$Y$3,0,#REF!)","v":{"$error":"#REF!"}},{"$f":"IF(#REF!>$Y$3,0,#REF!)","v":{"$error":"#REF!"}},{"$f":"IF(#REF!>$Y$3,0,#REF!)","v":{"$error":"#REF!"}},{"$f":"IF(#REF!>$Y$3,0,#REF!)","v":{"$error":"#REF!"}},{"$f":"IF(#REF!>$Y$3,0,#REF!)","v":{"$error":"#REF!"}}]
[null,null,23,null,null,null,null,null,null,null,null,null,null,null,null,null,null,null,null,null,null,null,null,null,null,null,null,null,null,null,null,null,null,null,null,null,null,null,null,null,null,null,null,null,null,null,null,null,null,null,null,null,null,null,null,null,null,0,{"$f":"IF(PARCIAL1!L$8=0,0,(ROUND(((BF27*10)/PARCIAL1!L$8),1)))","v":0},null,null,0,0,0,0,0,0,0,0,0,0,0,0,0,0,0,0,0,0,0,0,0,0,0,0,0,0,0,0,0,0,0,0,0,0,0,0,0,0,0,0,0,0,0,0,0,0,0,0,0,0,0,0,{"$f":"IF(#REF!>$Y$3,0,#REF!)","v":{"$error":"#REF!"}},{"$f":"IF(#REF!>$Y$3,0,#REF!)","v":{"$error":"#REF!"}},{"$f":"IF(#REF!>$Y$3,0,#REF!)","v":{"$error":"#REF!"}},{"$f":"IF(#REF!>$Y$3,0,#REF!)","v":{"$error":"#REF!"}},{"$f":"IF(#REF!>$Y$3,0,#REF!)","v":{"$error":"#REF!"}},{"$f":"IF(#REF!>$Y$3,0,#REF!)","v":{"$error":"#REF!"}},{"$f":"IF(#REF!>$Y$3,0,#REF!)","v":{"$error":"#REF!"}},{"$f":"IF(#REF!>$Y$3,0,#REF!)","v":{"$error":"#REF!"}},{"$f":"IF(#REF!>$Y$3,0,#REF!)","v":{"$error":"#REF!"}},{"$f":"IF(#REF!>$Y$3,0,#REF!)","v":{"$error":"#REF!"}},{"$f":"IF(#REF!>$Y$3,0,#REF!)","v":{"$error":"#REF!"}},{"$f":"IF(#REF!>$Y$3,0,#REF!)","v":{"$error":"#REF!"}},{"$f":"IF(#REF!>$Y$3,0,#REF!)","v":{"$error":"#REF!"}},{"$f":"IF(#REF!>$Y$3,0,#REF!)","v":{"$error":"#REF!"}},{"$f":"IF(#REF!>$Y$3,0,#REF!)","v":{"$error":"#REF!"}},{"$f":"IF(#REF!>$Y$3,0,#REF!)","v":{"$error":"#REF!"}},{"$f":"IF(#REF!>$Y$3,0,#REF!)","v":{"$error":"#REF!"}},{"$f":"IF(#REF!>$Y$3,0,#REF!)","v":{"$error":"#REF!"}},{"$f":"IF(#REF!>$Y$3,0,#REF!)","v":{"$error":"#REF!"}},{"$f":"IF(#REF!>$Y$3,0,#REF!)","v":{"$error":"#REF!"}},{"$f":"IF(#REF!>$Y$3,0,#REF!)","v":{"$error":"#REF!"}},{"$f":"IF(#REF!>$Y$3,0,#REF!)","v":{"$error":"#REF!"}},{"$f":"IF(#REF!>$Y$3,0,#REF!)","v":{"$error":"#REF!"}},{"$f":"IF(#REF!>$Y$3,0,#REF!)","v":{"$error":"#REF!"}},{"$f":"IF(#REF!>$Y$3,0,#REF!)","v":{"$error":"#REF!"}},{"$f":"IF(#REF!>$Y$3,0,#REF!)","v":{"$error":"#REF!"}},{"$f":"IF(#REF!>$Y$3,0,#REF!)","v":{"$error":"#REF!"}},{"$f":"IF(#REF!>$Y$3,0,#REF!)","v":{"$error":"#REF!"}}]
[null,null,24,null,null,null,null,null,null,null,null,null,null,null,null,null,null,null,null,null,null,null,null,null,null,null,null,null,null,null,null,null,null,null,null,null,null,null,null,null,null,null,null,null,null,null,null,null,null,null,null,null,null,null,null,null,null,0,{"$f":"IF(PARCIAL1!L$8=0,0,(ROUND(((BF28*10)/PARCIAL1!L$8),1)))","v":0},null,null,0,0,0,0,0,0,0,0,0,0,0,0,0,0,0,0,0,0,0,0,0,0,0,0,0,0,0,0,0,0,0,0,0,0,0,0,0,0,0,0,0,0,0,0,0,0,0,0,0,0,0,0,{"$f":"IF(#REF!>$Y$3,0,#REF!)","v":{"$error":"#REF!"}},{"$f":"IF(#REF!>$Y$3,0,#REF!)","v":{"$error":"#REF!"}},{"$f":"IF(#REF!>$Y$3,0,#REF!)","v":{"$error":"#REF!"}},{"$f":"IF(#REF!>$Y$3,0,#REF!)","v":{"$error":"#REF!"}},{"$f":"IF(#REF!>$Y$3,0,#REF!)","v":{"$error":"#REF!"}},{"$f":"IF(#REF!>$Y$3,0,#REF!)","v":{"$error":"#REF!"}},{"$f":"IF(#REF!>$Y$3,0,#REF!)","v":{"$error":"#REF!"}},{"$f":"IF(#REF!>$Y$3,0,#REF!)","v":{"$error":"#REF!"}},{"$f":"IF(#REF!>$Y$3,0,#REF!)","v":{"$error":"#REF!"}},{"$f":"IF(#REF!>$Y$3,0,#REF!)","v":{"$error":"#REF!"}},{"$f":"IF(#REF!>$Y$3,0,#REF!)","v":{"$error":"#REF!"}},{"$f":"IF(#REF!>$Y$3,0,#REF!)","v":{"$error":"#REF!"}},{"$f":"IF(#REF!>$Y$3,0,#REF!)","v":{"$error":"#REF!"}},{"$f":"IF(#REF!>$Y$3,0,#REF!)","v":{"$error":"#REF!"}},{"$f":"IF(#REF!>$Y$3,0,#REF!)","v":{"$error":"#REF!"}},{"$f":"IF(#REF!>$Y$3,0,#REF!)","v":{"$error":"#REF!"}},{"$f":"IF(#REF!>$Y$3,0,#REF!)","v":{"$error":"#REF!"}},{"$f":"IF(#REF!>$Y$3,0,#REF!)","v":{"$error":"#REF!"}},{"$f":"IF(#REF!>$Y$3,0,#REF!)","v":{"$error":"#REF!"}},{"$f":"IF(#REF!>$Y$3,0,#REF!)","v":{"$error":"#REF!"}},{"$f":"IF(#REF!>$Y$3,0,#REF!)","v":{"$error":"#REF!"}},{"$f":"IF(#REF!>$Y$3,0,#REF!)","v":{"$error":"#REF!"}},{"$f":"IF(#REF!>$Y$3,0,#REF!)","v":{"$error":"#REF!"}},{"$f":"IF(#REF!>$Y$3,0,#REF!)","v":{"$error":"#REF!"}},{"$f":"IF(#REF!>$Y$3,0,#REF!)","v":{"$error":"#REF!"}},{"$f":"IF(#REF!>$Y$3,0,#REF!)","v":{"$error":"#REF!"}},{"$f":"IF(#REF!>$Y$3,0,#REF!)","v":{"$error":"#REF!"}},{"$f":"IF(#REF!>$Y$3,0,#REF!)","v":{"$error":"#REF!"}}]
[null,null,25,null,null,null,null,null,null,null,null,null,null,null,null,null,null,null,null,null,null,null,null,null,null,null,null,null,null,null,null,null,null,null,null,null,null,null,null,null,null,null,null,null,null,null,null,null,null,null,null,null,null,null,null,null,null,0,{"$f":"IF(PARCIAL1!L$8=0,0,(ROUND(((BF29*10)/PARCIAL1!L$8),1)))","v":0},null,null,0,0,0,0,0,0,0,0,0,0,0,0,0,0,0,0,0,0,0,0,0,0,0,0,0,0,0,0,0,0,0,0,0,0,0,0,0,0,0,0,0,0,0,0,0,0,0,0,0,0,0,0,{"$f":"IF(#REF!>$Y$3,0,#REF!)","v":{"$error":"#REF!"}},{"$f":"IF(#REF!>$Y$3,0,#REF!)","v":{"$error":"#REF!"}},{"$f":"IF(#REF!>$Y$3,0,#REF!)","v":{"$error":"#REF!"}},{"$f":"IF(#REF!>$Y$3,0,#REF!)","v":{"$error":"#REF!"}},{"$f":"IF(#REF!>$Y$3,0,#REF!)","v":{"$error":"#REF!"}},{"$f":"IF(#REF!>$Y$3,0,#REF!)","v":{"$error":"#REF!"}},{"$f":"IF(#REF!>$Y$3,0,#REF!)","v":{"$error":"#REF!"}},{"$f":"IF(#REF!>$Y$3,0,#REF!)","v":{"$error":"#REF!"}},{"$f":"IF(#REF!>$Y$3,0,#REF!)","v":{"$error":"#REF!"}},{"$f":"IF(#REF!>$Y$3,0,#REF!)","v":{"$error":"#REF!"}},{"$f":"IF(#REF!>$Y$3,0,#REF!)","v":{"$error":"#REF!"}},{"$f":"IF(#REF!>$Y$3,0,#REF!)","v":{"$error":"#REF!"}},{"$f":"IF(#REF!>$Y$3,0,#REF!)","v":{"$error":"#REF!"}},{"$f":"IF(#REF!>$Y$3,0,#REF!)","v":{"$error":"#REF!"}},{"$f":"IF(#REF!>$Y$3,0,#REF!)","v":{"$error":"#REF!"}},{"$f":"IF(#REF!>$Y$3,0,#REF!)","v":{"$error":"#REF!"}},{"$f":"IF(#REF!>$Y$3,0,#REF!)","v":{"$error":"#REF!"}},{"$f":"IF(#REF!>$Y$3,0,#REF!)","v":{"$error":"#REF!"}},{"$f":"IF(#REF!>$Y$3,0,#REF!)","v":{"$error":"#REF!"}},{"$f":"IF(#REF!>$Y$3,0,#REF!)","v":{"$error":"#REF!"}},{"$f":"IF(#REF!>$Y$3,0,#REF!)","v":{"$error":"#REF!"}},{"$f":"IF(#REF!>$Y$3,0,#REF!)","v":{"$error":"#REF!"}},{"$f":"IF(#REF!>$Y$3,0,#REF!)","v":{"$error":"#REF!"}},{"$f":"IF(#REF!>$Y$3,0,#REF!)","v":{"$error":"#REF!"}},{"$f":"IF(#REF!>$Y$3,0,#REF!)","v":{"$error":"#REF!"}},{"$f":"IF(#REF!>$Y$3,0,#REF!)","v":{"$error":"#REF!"}},{"$f":"IF(#REF!>$Y$3,0,#REF!)","v":{"$error":"#REF!"}},{"$f":"IF(#REF!>$Y$3,0,#REF!)","v":{"$error":"#REF!"}}]
[null,null,26,null,null,null,null,null,null,null,null,null,null,null,null,null,null,null,null,null,null,null,null,null,null,null,null,null,null,null,null,null,null,null,null,null,null,null,null,null,null,null,null,null,null,null,null,null,null,null,null,null,null,null,null,null,null,0,{"$f":"IF(PARCIAL1!L$8=0,0,(ROUND(((BF30*10)/PARCIAL1!L$8),1)))","v":0},null,null,0,0,0,0,0,0,0,0,0,0,0,0,0,0,0,0,0,0,0,0,0,0,0,0,0,0,0,0,0,0,0,0,0,0,0,0,0,0,0,0,0,0,0,0,0,0,0,0,0,0,0,0,{"$f":"IF(#REF!>$Y$3,0,#REF!)","v":{"$error":"#REF!"}},{"$f":"IF(#REF!>$Y$3,0,#REF!)","v":{"$error":"#REF!"}},{"$f":"IF(#REF!>$Y$3,0,#REF!)","v":{"$error":"#REF!"}},{"$f":"IF(#REF!>$Y$3,0,#REF!)","v":{"$error":"#REF!"}},{"$f":"IF(#REF!>$Y$3,0,#REF!)","v":{"$error":"#REF!"}},{"$f":"IF(#REF!>$Y$3,0,#REF!)","v":{"$error":"#REF!"}},{"$f":"IF(#REF!>$Y$3,0,#REF!)","v":{"$error":"#REF!"}},{"$f":"IF(#REF!>$Y$3,0,#REF!)","v":{"$error":"#REF!"}},{"$f":"IF(#REF!>$Y$3,0,#REF!)","v":{"$error":"#REF!"}},{"$f":"IF(#REF!>$Y$3,0,#REF!)","v":{"$error":"#REF!"}},{"$f":"IF(#REF!>$Y$3,0,#REF!)","v":{"$error":"#REF!"}},{"$f":"IF(#REF!>$Y$3,0,#REF!)","v":{"$error":"#REF!"}},{"$f":"IF(#REF!>$Y$3,0,#REF!)","v":{"$error":"#REF!"}},{"$f":"IF(#REF!>$Y$3,0,#REF!)","v":{"$error":"#REF!"}},{"$f":"IF(#REF!>$Y$3,0,#REF!)","v":{"$error":"#REF!"}},{"$f":"IF(#REF!>$Y$3,0,#REF!)","v":{"$error":"#REF!"}},{"$f":"IF(#REF!>$Y$3,0,#REF!)","v":{"$error":"#REF!"}},{"$f":"IF(#REF!>$Y$3,0,#REF!)","v":{"$error":"#REF!"}},{"$f":"IF(#REF!>$Y$3,0,#REF!)","v":{"$error":"#REF!"}},{"$f":"IF(#REF!>$Y$3,0,#REF!)","v":{"$error":"#REF!"}},{"$f":"IF(#REF!>$Y$3,0,#REF!)","v":{"$error":"#REF!"}},{"$f":"IF(#REF!>$Y$3,0,#REF!)","v":{"$error":"#REF!"}},{"$f":"IF(#REF!>$Y$3,0,#REF!)","v":{"$error":"#REF!"}},{"$f":"IF(#REF!>$Y$3,0,#REF!)","v":{"$error":"#REF!"}},{"$f":"IF(#REF!>$Y$3,0,#REF!)","v":{"$error":"#REF!"}},{"$f":"IF(#REF!>$Y$3,0,#REF!)","v":{"$error":"#REF!"}},{"$f":"IF(#REF!>$Y$3,0,#REF!)","v":{"$error":"#REF!"}},{"$f":"IF(#REF!>$Y$3,0,#REF!)","v":{"$error":"#REF!"}}]
[null,null,27,null,null,null,null,null,null,null,null,null,null,null,null,null,null,null,null,null,null,null,null,null,null,null,null,null,null,null,null,null,null,null,null,null,null,null,null,null,null,null,null,null,null,null,null,null,null,null,null,null,null,null,null,null,null,0,{"$f":"IF(PARCIAL1!L$8=0,0,(ROUND(((BF31*10)/PARCIAL1!L$8),1)))","v":0},null,null,0,0,0,0,0,0,0,0,0,0,0,0,0,0,0,0,0,0,0,0,0,0,0,0,0,0,0,0,0,0,0,0,0,0,0,0,0,0,0,0,0,0,0,0,0,0,0,0,0,0,0,0,{"$f":"IF(#REF!>$Y$3,0,#REF!)","v":{"$error":"#REF!"}},{"$f":"IF(#REF!>$Y$3,0,#REF!)","v":{"$error":"#REF!"}},{"$f":"IF(#REF!>$Y$3,0,#REF!)","v":{"$error":"#REF!"}},{"$f":"IF(#REF!>$Y$3,0,#REF!)","v":{"$error":"#REF!"}},{"$f":"IF(#REF!>$Y$3,0,#REF!)","v":{"$error":"#REF!"}},{"$f":"IF(#REF!>$Y$3,0,#REF!)","v":{"$error":"#REF!"}},{"$f":"IF(#REF!>$Y$3,0,#REF!)","v":{"$error":"#REF!"}},{"$f":"IF(#REF!>$Y$3,0,#REF!)","v":{"$error":"#REF!"}},{"$f":"IF(#REF!>$Y$3,0,#REF!)","v":{"$error":"#REF!"}},{"$f":"IF(#REF!>$Y$3,0,#REF!)","v":{"$error":"#REF!"}},{"$f":"IF(#REF!>$Y$3,0,#REF!)","v":{"$error":"#REF!"}},{"$f":"IF(#REF!>$Y$3,0,#REF!)","v":{"$error":"#REF!"}},{"$f":"IF(#REF!>$Y$3,0,#REF!)","v":{"$error":"#REF!"}},{"$f":"IF(#REF!>$Y$3,0,#REF!)","v":{"$error":"#REF!"}},{"$f":"IF(#REF!>$Y$3,0,#REF!)","v":{"$error":"#REF!"}},{"$f":"IF(#REF!>$Y$3,0,#REF!)","v":{"$error":"#REF!"}},{"$f":"IF(#REF!>$Y$3,0,#REF!)","v":{"$error":"#REF!"}},{"$f":"IF(#REF!>$Y$3,0,#REF!)","v":{"$error":"#REF!"}},{"$f":"IF(#REF!>$Y$3,0,#REF!)","v":{"$error":"#REF!"}},{"$f":"IF(#REF!>$Y$3,0,#REF!)","v":{"$error":"#REF!"}},{"$f":"IF(#REF!>$Y$3,0,#REF!)","v":{"$error":"#REF!"}},{"$f":"IF(#REF!>$Y$3,0,#REF!)","v":{"$error":"#REF!"}},{"$f":"IF(#REF!>$Y$3,0,#REF!)","v":{"$error":"#REF!"}},{"$f":"IF(#REF!>$Y$3,0,#REF!)","v":{"$error":"#REF!"}},{"$f":"IF(#REF!>$Y$3,0,#REF!)","v":{"$error":"#REF!"}},{"$f":"IF(#REF!>$Y$3,0,#REF!)","v":{"$error":"#REF!"}},{"$f":"IF(#REF!>$Y$3,0,#REF!)","v":{"$error":"#REF!"}},{"$f":"IF(#REF!>$Y$3,0,#REF!)","v":{"$error":"#REF!"}}]
[null,null,28,null,null,null,null,null,null,null,null,null,null,null,null,null,null,null,null,null,null,null,null,null,null,null,null,null,null,null,null,null,null,null,null,null,null,null,null,null,null,null,null,null,null,null,null,null,null,null,null,null,null,null,null,null,null,0,{"$f":"IF(PARCIAL1!L$8=0,0,(ROUND(((BF32*10)/PARCIAL1!L$8),1)))","v":0},null,null,0,0,0,0,0,0,0,0,0,0,0,0,0,0,0,0,0,0,0,0,0,0,0,0,0,0,0,0,0,0,0,0,0,0,0,0,0,0,0,0,0,0,0,0,0,0,0,0,0,0,0,0,{"$f":"IF(#REF!>$Y$3,0,#REF!)","v":{"$error":"#REF!"}},{"$f":"IF(#REF!>$Y$3,0,#REF!)","v":{"$error":"#REF!"}},{"$f":"IF(#REF!>$Y$3,0,#REF!)","v":{"$error":"#REF!"}},{"$f":"IF(#REF!>$Y$3,0,#REF!)","v":{"$error":"#REF!"}},{"$f":"IF(#REF!>$Y$3,0,#REF!)","v":{"$error":"#REF!"}},{"$f":"IF(#REF!>$Y$3,0,#REF!)","v":{"$error":"#REF!"}},{"$f":"IF(#REF!>$Y$3,0,#REF!)","v":{"$error":"#REF!"}},{"$f":"IF(#REF!>$Y$3,0,#REF!)","v":{"$error":"#REF!"}},{"$f":"IF(#REF!>$Y$3,0,#REF!)","v":{"$error":"#REF!"}},{"$f":"IF(#REF!>$Y$3,0,#REF!)","v":{"$error":"#REF!"}},{"$f":"IF(#REF!>$Y$3,0,#REF!)","v":{"$error":"#REF!"}},{"$f":"IF(#REF!>$Y$3,0,#REF!)","v":{"$error":"#REF!"}},{"$f":"IF(#REF!>$Y$3,0,#REF!)","v":{"$error":"#REF!"}},{"$f":"IF(#REF!>$Y$3,0,#REF!)","v":{"$error":"#REF!"}},{"$f":"IF(#REF!>$Y$3,0,#REF!)","v":{"$error":"#REF!"}},{"$f":"IF(#REF!>$Y$3,0,#REF!)","v":{"$error":"#REF!"}},{"$f":"IF(#REF!>$Y$3,0,#REF!)","v":{"$error":"#REF!"}},{"$f":"IF(#REF!>$Y$3,0,#REF!)","v":{"$error":"#REF!"}},{"$f":"IF(#REF!>$Y$3,0,#REF!)","v":{"$error":"#REF!"}},{"$f":"IF(#REF!>$Y$3,0,#REF!)","v":{"$error":"#REF!"}},{"$f":"IF(#REF!>$Y$3,0,#REF!)","v":{"$error":"#REF!"}},{"$f":"IF(#REF!>$Y$3,0,#REF!)","v":{"$error":"#REF!"}},{"$f":"IF(#REF!>$Y$3,0,#REF!)","v":{"$error":"#REF!"}},{"$f":"IF(#REF!>$Y$3,0,#REF!)","v":{"$error":"#REF!"}},{"$f":"IF(#REF!>$Y$3,0,#REF!)","v":{"$error":"#REF!"}},{"$f":"IF(#REF!>$Y$3,0,#REF!)","v":{"$error":"#REF!"}},{"$f":"IF(#REF!>$Y$3,0,#REF!)","v":{"$error":"#REF!"}},{"$f":"IF(#REF!>$Y$3,0,#REF!)","v":{"$error":"#REF!"}}]
[null,null,29,null,null,null,null,null,null,null,null,null,null,null,null,null,null,null,null,null,null,null,null,null,null,null,null,null,null,null,null,null,null,null,null,null,null,null,null,null,null,null,null,null,null,null,null,null,null,null,null,null,null,null,null,null,null,0,{"$f":"IF(PARCIAL1!L$8=0,0,(ROUND(((BF33*10)/PARCIAL1!L$8),1)))","v":0},null,null,0,0,0,0,0,0,0,0,0,0,0,0,0,0,0,0,0,0,0,0,0,0,0,0,0,0,0,0,0,0,0,0,0,0,0,0,0,0,0,0,0,0,0,0,0,0,0,0,0,0,0,0,{"$f":"IF(#REF!>$Y$3,0,#REF!)","v":{"$error":"#REF!"}},{"$f":"IF(#REF!>$Y$3,0,#REF!)","v":{"$error":"#REF!"}},{"$f":"IF(#REF!>$Y$3,0,#REF!)","v":{"$error":"#REF!"}},{"$f":"IF(#REF!>$Y$3,0,#REF!)","v":{"$error":"#REF!"}},{"$f":"IF(#REF!>$Y$3,0,#REF!)","v":{"$error":"#REF!"}},{"$f":"IF(#REF!>$Y$3,0,#REF!)","v":{"$error":"#REF!"}},{"$f":"IF(#REF!>$Y$3,0,#REF!)","v":{"$error":"#REF!"}},{"$f":"IF(#REF!>$Y$3,0,#REF!)","v":{"$error":"#REF!"}},{"$f":"IF(#REF!>$Y$3,0,#REF!)","v":{"$error":"#REF!"}},{"$f":"IF(#REF!>$Y$3,0,#REF!)","v":{"$error":"#REF!"}},{"$f":"IF(#REF!>$Y$3,0,#REF!)","v":{"$error":"#REF!"}},{"$f":"IF(#REF!>$Y$3,0,#REF!)","v":{"$error":"#REF!"}},{"$f":"IF(#REF!>$Y$3,0,#REF!)","v":{"$error":"#REF!"}},{"$f":"IF(#REF!>$Y$3,0,#REF!)","v":{"$error":"#REF!"}},{"$f":"IF(#REF!>$Y$3,0,#REF!)","v":{"$error":"#REF!"}},{"$f":"IF(#REF!>$Y$3,0,#REF!)","v":{"$error":"#REF!"}},{"$f":"IF(#REF!>$Y$3,0,#REF!)","v":{"$error":"#REF!"}},{"$f":"IF(#REF!>$Y$3,0,#REF!)","v":{"$error":"#REF!"}},{"$f":"IF(#REF!>$Y$3,0,#REF!)","v":{"$error":"#REF!"}},{"$f":"IF(#REF!>$Y$3,0,#REF!)","v":{"$error":"#REF!"}},{"$f":"IF(#REF!>$Y$3,0,#REF!)","v":{"$error":"#REF!"}},{"$f":"IF(#REF!>$Y$3,0,#REF!)","v":{"$error":"#REF!"}},{"$f":"IF(#REF!>$Y$3,0,#REF!)","v":{"$error":"#REF!"}},{"$f":"IF(#REF!>$Y$3,0,#REF!)","v":{"$error":"#REF!"}},{"$f":"IF(#REF!>$Y$3,0,#REF!)","v":{"$error":"#REF!"}},{"$f":"IF(#REF!>$Y$3,0,#REF!)","v":{"$error":"#REF!"}},{"$f":"IF(#REF!>$Y$3,0,#REF!)","v":{"$error":"#REF!"}},{"$f":"IF(#REF!>$Y$3,0,#REF!)","v":{"$error":"#REF!"}}]
[null,null,30,null,null,null,null,null,null,null,null,null,null,null,null,null,null,null,null,null,null,null,null,null,null,null,null,null,null,null,null,null,null,null,null,null,null,null,null,null,null,null,null,null,null,null,null,null,null,null,null,null,null,null,null,null,null,0,{"$f":"IF(PARCIAL1!L$8=0,0,(ROUND(((BF34*10)/PARCIAL1!L$8),1)))","v":0},null,null,0,0,0,0,0,0,0,0,0,0,0,0,0,0,0,0,0,0,0,0,0,0,0,0,0,0,0,0,0,0,0,0,0,0,0,0,0,0,0,0,0,0,0,0,0,0,0,0,0,0,0,0,{"$f":"IF(#REF!>$Y$3,0,#REF!)","v":{"$error":"#REF!"}},{"$f":"IF(#REF!>$Y$3,0,#REF!)","v":{"$error":"#REF!"}},{"$f":"IF(#REF!>$Y$3,0,#REF!)","v":{"$error":"#REF!"}},{"$f":"IF(#REF!>$Y$3,0,#REF!)","v":{"$error":"#REF!"}},{"$f":"IF(#REF!>$Y$3,0,#REF!)","v":{"$error":"#REF!"}},{"$f":"IF(#REF!>$Y$3,0,#REF!)","v":{"$error":"#REF!"}},{"$f":"IF(#REF!>$Y$3,0,#REF!)","v":{"$error":"#REF!"}},{"$f":"IF(#REF!>$Y$3,0,#REF!)","v":{"$error":"#REF!"}},{"$f":"IF(#REF!>$Y$3,0,#REF!)","v":{"$error":"#REF!"}},{"$f":"IF(#REF!>$Y$3,0,#REF!)","v":{"$error":"#REF!"}},{"$f":"IF(#REF!>$Y$3,0,#REF!)","v":{"$error":"#REF!"}},{"$f":"IF(#REF!>$Y$3,0,#REF!)","v":{"$error":"#REF!"}},{"$f":"IF(#REF!>$Y$3,0,#REF!)","v":{"$error":"#REF!"}},{"$f":"IF(#REF!>$Y$3,0,#REF!)","v":{"$error":"#REF!"}},{"$f":"IF(#REF!>$Y$3,0,#REF!)","v":{"$error":"#REF!"}},{"$f":"IF(#REF!>$Y$3,0,#REF!)","v":{"$error":"#REF!"}},{"$f":"IF(#REF!>$Y$3,0,#REF!)","v":{"$error":"#REF!"}},{"$f":"IF(#REF!>$Y$3,0,#REF!)","v":{"$error":"#REF!"}},{"$f":"IF(#REF!>$Y$3,0,#REF!)","v":{"$error":"#REF!"}},{"$f":"IF(#REF!>$Y$3,0,#REF!)","v":{"$error":"#REF!"}},{"$f":"IF(#REF!>$Y$3,0,#REF!)","v":{"$error":"#REF!"}},{"$f":"IF(#REF!>$Y$3,0,#REF!)","v":{"$error":"#REF!"}},{"$f":"IF(#REF!>$Y$3,0,#REF!)","v":{"$error":"#REF!"}},{"$f":"IF(#REF!>$Y$3,0,#REF!)","v":{"$error":"#REF!"}},{"$f":"IF(#REF!>$Y$3,0,#REF!)","v":{"$error":"#REF!"}},{"$f":"IF(#REF!>$Y$3,0,#REF!)","v":{"$error":"#REF!"}},{"$f":"IF(#REF!>$Y$3,0,#REF!)","v":{"$error":"#REF!"}},{"$f":"IF(#REF!>$Y$3,0,#REF!)","v":{"$error":"#REF!"}}]
[null,null,31,null,null,null,null,null,null,null,null,null,null,null,null,null,null,null,null,null,null,null,null,null,null,null,null,null,null,null,null,null,null,null,null,null,null,null,null,null,null,null,null,null,null,null,null,null,null,null,null,null,null,null,null,null,null,0,{"$f":"IF(PARCIAL1!L$8=0,0,(ROUND(((BF35*10)/PARCIAL1!L$8),1)))","v":0},null,null,0,0,0,0,0,0,0,0,0,0,0,0,0,0,0,0,0,0,0,0,0,0,0,0,0,0,0,0,0,0,0,0,0,0,0,0,0,0,0,0,0,0,0,0,0,0,0,0,0,0,0,0,{"$f":"IF(#REF!>$Y$3,0,#REF!)","v":{"$error":"#REF!"}},{"$f":"IF(#REF!>$Y$3,0,#REF!)","v":{"$error":"#REF!"}},{"$f":"IF(#REF!>$Y$3,0,#REF!)","v":{"$error":"#REF!"}},{"$f":"IF(#REF!>$Y$3,0,#REF!)","v":{"$error":"#REF!"}},{"$f":"IF(#REF!>$Y$3,0,#REF!)","v":{"$error":"#REF!"}},{"$f":"IF(#REF!>$Y$3,0,#REF!)","v":{"$error":"#REF!"}},{"$f":"IF(#REF!>$Y$3,0,#REF!)","v":{"$error":"#REF!"}},{"$f":"IF(#REF!>$Y$3,0,#REF!)","v":{"$error":"#REF!"}},{"$f":"IF(#REF!>$Y$3,0,#REF!)","v":{"$error":"#REF!"}},{"$f":"IF(#REF!>$Y$3,0,#REF!)","v":{"$error":"#REF!"}},{"$f":"IF(#REF!>$Y$3,0,#REF!)","v":{"$error":"#REF!"}},{"$f":"IF(#REF!>$Y$3,0,#REF!)","v":{"$error":"#REF!"}},{"$f":"IF(#REF!>$Y$3,0,#REF!)","v":{"$error":"#REF!"}},{"$f":"IF(#REF!>$Y$3,0,#REF!)","v":{"$error":"#REF!"}},{"$f":"IF(#REF!>$Y$3,0,#REF!)","v":{"$error":"#REF!"}},{"$f":"IF(#REF!>$Y$3,0,#REF!)","v":{"$error":"#REF!"}},{"$f":"IF(#REF!>$Y$3,0,#REF!)","v":{"$error":"#REF!"}},{"$f":"IF(#REF!>$Y$3,0,#REF!)","v":{"$error":"#REF!"}},{"$f":"IF(#REF!>$Y$3,0,#REF!)","v":{"$error":"#REF!"}},{"$f":"IF(#REF!>$Y$3,0,#REF!)","v":{"$error":"#REF!"}},{"$f":"IF(#REF!>$Y$3,0,#REF!)","v":{"$error":"#REF!"}},{"$f":"IF(#REF!>$Y$3,0,#REF!)","v":{"$error":"#REF!"}},{"$f":"IF(#REF!>$Y$3,0,#REF!)","v":{"$error":"#REF!"}},{"$f":"IF(#REF!>$Y$3,0,#REF!)","v":{"$error":"#REF!"}},{"$f":"IF(#REF!>$Y$3,0,#REF!)","v":{"$error":"#REF!"}},{"$f":"IF(#REF!>$Y$3,0,#REF!)","v":{"$error":"#REF!"}},{"$f":"IF(#REF!>$Y$3,0,#REF!)","v":{"$error":"#REF!"}},{"$f":"IF(#REF!>$Y$3,0,#REF!)","v":{"$error":"#REF!"}}]
[null,null,32,null,null,null,null,null,null,null,null,null,null,null,null,null,null,null,null,null,null,null,null,null,null,null,null,null,null,null,null,null,null,null,null,null,null,null,null,null,null,null,null,null,null,null,null,null,null,null,null,null,null,null,null,null,null,0,{"$f":"IF(PARCIAL1!L$8=0,0,(ROUND(((BF36*10)/PARCIAL1!L$8),1)))","v":0},null,null,0,0,0,0,0,0,0,0,0,0,0,0,0,0,0,0,0,0,0,0,0,0,0,0,0,0,0,0,0,0,0,0,0,0,0,0,0,0,0,0,0,0,0,0,0,0,0,0,0,0,0,0,{"$f":"IF(#REF!>$Y$3,0,#REF!)","v":{"$error":"#REF!"}},{"$f":"IF(#REF!>$Y$3,0,#REF!)","v":{"$error":"#REF!"}},{"$f":"IF(#REF!>$Y$3,0,#REF!)","v":{"$error":"#REF!"}},{"$f":"IF(#REF!>$Y$3,0,#REF!)","v":{"$error":"#REF!"}},{"$f":"IF(#REF!>$Y$3,0,#REF!)","v":{"$error":"#REF!"}},{"$f":"IF(#REF!>$Y$3,0,#REF!)","v":{"$error":"#REF!"}},{"$f":"IF(#REF!>$Y$3,0,#REF!)","v":{"$error":"#REF!"}},{"$f":"IF(#REF!>$Y$3,0,#REF!)","v":{"$error":"#REF!"}},{"$f":"IF(#REF!>$Y$3,0,#REF!)","v":{"$error":"#REF!"}},{"$f":"IF(#REF!>$Y$3,0,#REF!)","v":{"$error":"#REF!"}},{"$f":"IF(#REF!>$Y$3,0,#REF!)","v":{"$error":"#REF!"}},{"$f":"IF(#REF!>$Y$3,0,#REF!)","v":{"$error":"#REF!"}},{"$f":"IF(#REF!>$Y$3,0,#REF!)","v":{"$error":"#REF!"}},{"$f":"IF(#REF!>$Y$3,0,#REF!)","v":{"$error":"#REF!"}},{"$f":"IF(#REF!>$Y$3,0,#REF!)","v":{"$error":"#REF!"}},{"$f":"IF(#REF!>$Y$3,0,#REF!)","v":{"$error":"#REF!"}},{"$f":"IF(#REF!>$Y$3,0,#REF!)","v":{"$error":"#REF!"}},{"$f":"IF(#REF!>$Y$3,0,#REF!)","v":{"$error":"#REF!"}},{"$f":"IF(#REF!>$Y$3,0,#REF!)","v":{"$error":"#REF!"}},{"$f":"IF(#REF!>$Y$3,0,#REF!)","v":{"$error":"#REF!"}},{"$f":"IF(#REF!>$Y$3,0,#REF!)","v":{"$error":"#REF!"}},{"$f":"IF(#REF!>$Y$3,0,#REF!)","v":{"$error":"#REF!"}},{"$f":"IF(#REF!>$Y$3,0,#REF!)","v":{"$error":"#REF!"}},{"$f":"IF(#REF!>$Y$3,0,#REF!)","v":{"$error":"#REF!"}},{"$f":"IF(#REF!>$Y$3,0,#REF!)","v":{"$error":"#REF!"}},{"$f":"IF(#REF!>$Y$3,0,#REF!)","v":{"$error":"#REF!"}},{"$f":"IF(#REF!>$Y$3,0,#REF!)","v":{"$error":"#REF!"}},{"$f":"IF(#REF!>$Y$3,0,#REF!)","v":{"$error":"#REF!"}}]
[null,null,33,null,null,null,null,null,null,null,null,null,null,null,null,null,null,null,null,null,null,null,null,null,null,null,null,null,null,null,null,null,null,null,null,null,null,null,null,null,null,null,null,null,null,null,null,null,null,null,null,null,null,null,null,null,null,0,{"$f":"IF(PARCIAL1!L$8=0,0,(ROUND(((BF37*10)/PARCIAL1!L$8),1)))","v":0},null,null,0,0,0,0,0,0,0,0,0,0,0,0,0,0,0,0,0,0,0,0,0,0,0,0,0,0,0,0,0,0,0,0,0,0,0,0,0,0,0,0,0,0,0,0,0,0,0,0,0,0,0,0,{"$f":"IF(#REF!>$Y$3,0,#REF!)","v":{"$error":"#REF!"}},{"$f":"IF(#REF!>$Y$3,0,#REF!)","v":{"$error":"#REF!"}},{"$f":"IF(#REF!>$Y$3,0,#REF!)","v":{"$error":"#REF!"}},{"$f":"IF(#REF!>$Y$3,0,#REF!)","v":{"$error":"#REF!"}},{"$f":"IF(#REF!>$Y$3,0,#REF!)","v":{"$error":"#REF!"}},{"$f":"IF(#REF!>$Y$3,0,#REF!)","v":{"$error":"#REF!"}},{"$f":"IF(#REF!>$Y$3,0,#REF!)","v":{"$error":"#REF!"}},{"$f":"IF(#REF!>$Y$3,0,#REF!)","v":{"$error":"#REF!"}},{"$f":"IF(#REF!>$Y$3,0,#REF!)","v":{"$error":"#REF!"}},{"$f":"IF(#REF!>$Y$3,0,#REF!)","v":{"$error":"#REF!"}},{"$f":"IF(#REF!>$Y$3,0,#REF!)","v":{"$error":"#REF!"}},{"$f":"IF(#REF!>$Y$3,0,#REF!)","v":{"$error":"#REF!"}},{"$f":"IF(#REF!>$Y$3,0,#REF!)","v":{"$error":"#REF!"}},{"$f":"IF(#REF!>$Y$3,0,#REF!)","v":{"$error":"#REF!"}},{"$f":"IF(#REF!>$Y$3,0,#REF!)","v":{"$error":"#REF!"}},{"$f":"IF(#REF!>$Y$3,0,#REF!)","v":{"$error":"#REF!"}},{"$f":"IF(#REF!>$Y$3,0,#REF!)","v":{"$error":"#REF!"}},{"$f":"IF(#REF!>$Y$3,0,#REF!)","v":{"$error":"#REF!"}},{"$f":"IF(#REF!>$Y$3,0,#REF!)","v":{"$error":"#REF!"}},{"$f":"IF(#REF!>$Y$3,0,#REF!)","v":{"$error":"#REF!"}},{"$f":"IF(#REF!>$Y$3,0,#REF!)","v":{"$error":"#REF!"}},{"$f":"IF(#REF!>$Y$3,0,#REF!)","v":{"$error":"#REF!"}},{"$f":"IF(#REF!>$Y$3,0,#REF!)","v":{"$error":"#REF!"}},{"$f":"IF(#REF!>$Y$3,0,#REF!)","v":{"$error":"#REF!"}},{"$f":"IF(#REF!>$Y$3,0,#REF!)","v":{"$error":"#REF!"}},{"$f":"IF(#REF!>$Y$3,0,#REF!)","v":{"$error":"#REF!"}},{"$f":"IF(#REF!>$Y$3,0,#REF!)","v":{"$error":"#REF!"}},{"$f":"IF(#REF!>$Y$3,0,#REF!)","v":{"$error":"#REF!"}}]
[null,null,34,null,null,null,null,null,null,null,null,null,null,null,null,null,null,null,null,null,null,null,null,null,null,null,null,null,null,null,null,null,null,null,null,null,null,null,null,null,null,null,null,null,null,null,null,null,null,null,null,null,null,null,null,null,null,0,{"$f":"IF(PARCIAL1!L$8=0,0,(ROUND(((BF38*10)/PARCIAL1!L$8),1)))","v":0},null,null,0,0,0,0,0,0,0,0,0,0,0,0,0,0,0,0,0,0,0,0,0,0,0,0,0,0,0,0,0,0,0,0,0,0,0,0,0,0,0,0,0,0,0,0,0,0,0,0,0,0,0,0,{"$f":"IF(#REF!>$Y$3,0,#REF!)","v":{"$error":"#REF!"}},{"$f":"IF(#REF!>$Y$3,0,#REF!)","v":{"$error":"#REF!"}},{"$f":"IF(#REF!>$Y$3,0,#REF!)","v":{"$error":"#REF!"}},{"$f":"IF(#REF!>$Y$3,0,#REF!)","v":{"$error":"#REF!"}},{"$f":"IF(#REF!>$Y$3,0,#REF!)","v":{"$error":"#REF!"}},{"$f":"IF(#REF!>$Y$3,0,#REF!)","v":{"$error":"#REF!"}},{"$f":"IF(#REF!>$Y$3,0,#REF!)","v":{"$error":"#REF!"}},{"$f":"IF(#REF!>$Y$3,0,#REF!)","v":{"$error":"#REF!"}},{"$f":"IF(#REF!>$Y$3,0,#REF!)","v":{"$error":"#REF!"}},{"$f":"IF(#REF!>$Y$3,0,#REF!)","v":{"$error":"#REF!"}},{"$f":"IF(#REF!>$Y$3,0,#REF!)","v":{"$error":"#REF!"}},{"$f":"IF(#REF!>$Y$3,0,#REF!)","v":{"$error":"#REF!"}},{"$f":"IF(#REF!>$Y$3,0,#REF!)","v":{"$error":"#REF!"}},{"$f":"IF(#REF!>$Y$3,0,#REF!)","v":{"$error":"#REF!"}},{"$f":"IF(#REF!>$Y$3,0,#REF!)","v":{"$error":"#REF!"}},{"$f":"IF(#REF!>$Y$3,0,#REF!)","v":{"$error":"#REF!"}},{"$f":"IF(#REF!>$Y$3,0,#REF!)","v":{"$error":"#REF!"}},{"$f":"IF(#REF!>$Y$3,0,#REF!)","v":{"$error":"#REF!"}},{"$f":"IF(#REF!>$Y$3,0,#REF!)","v":{"$error":"#REF!"}},{"$f":"IF(#REF!>$Y$3,0,#REF!)","v":{"$error":"#REF!"}},{"$f":"IF(#REF!>$Y$3,0,#REF!)","v":{"$error":"#REF!"}},{"$f":"IF(#REF!>$Y$3,0,#REF!)","v":{"$error":"#REF!"}},{"$f":"IF(#REF!>$Y$3,0,#REF!)","v":{"$error":"#REF!"}},{"$f":"IF(#REF!>$Y$3,0,#REF!)","v":{"$error":"#REF!"}},{"$f":"IF(#REF!>$Y$3,0,#REF!)","v":{"$error":"#REF!"}},{"$f":"IF(#REF!>$Y$3,0,#REF!)","v":{"$error":"#REF!"}},{"$f":"IF(#REF!>$Y$3,0,#REF!)","v":{"$error":"#REF!"}},{"$f":"IF(#REF!>$Y$3,0,#REF!)","v":{"$error":"#REF!"}}]
[null,null,35,null,null,null,null,null,null,null,null,null,null,null,null,null,null,null,null,null,null,null,null,null,null,null,null,null,null,null,null,null,null,null,null,null,null,null,null,null,null,null,null,null,null,null,null,null,null,null,null,null,null,null,null,null,null,0,{"$f":"IF(PARCIAL1!L$8=0,0,(ROUND(((BF39*10)/PARCIAL1!L$8),1)))","v":0},null,null,{"$f":"IF(F39>$Y$3,0,F39)","v":0},{"$f":"IF(G39>$Y$3,0,G39)","v":0},{"$f":"IF(H39>$Y$3,0,H39)","v":0},{"$f":"IF(I39>$Y$3,0,I39)","v":0},{"$f":"IF(J39>$Y$3,0,J39)","v":0},{"$f":"IF(K39>$Y$3,0,K39)","v":0},{"$f":"IF(L39>$Y$3,0,L39)","v":0},{"$f":"IF(M39>$Y$3,0,M39)","v":0},{"$f":"IF(N39>$Y$3,0,N39)","v":0},{"$f":"IF(O39>$Y$3,0,O39)","v":0},{"$f":"IF(P39>$Y$3,0,P39)","v":0},{"$f":"IF(Q39>$Y$3,0,Q39)","v":0},{"$f":"IF(R39>$Y$3,0,R39)","v":0},{"$f":"IF(S39>$Y$3,0,S39)","v":0},{"$f":"IF(T39>$Y$3,0,T39)","v":0},{"$f":"IF(U39>$Y$3,0,U39)","v":0},{"$f":"IF(V39>$Y$3,0,V39)","v":0},{"$f":"IF(W39>$Y$3,0,W39)","v":0},{"$f":"IF(X39>$Y$3,0,X39)","v":0},{"$f":"IF(Y39>$Y$3,0,Y39)","v":0},{"$f":"IF(Z39>$Y$3,0,Z39)","v":0},{"$f":"IF(AA39>$Y$3,0,AA39)","v":0},{"$f":"IF(AB39>$Y$3,0,AB39)","v":0},{"$f":"IF(AC39>$Y$3,0,AC39)","v":0},{"$f":"IF(AD39>$Y$3,0,AD39)","v":0},{"$f":"IF(AE39>$Y$3,0,AE39)","v":0},{"$f":"IF(AF39>$Y$3,0,AF39)","v":0},{"$f":"IF(AG39>$Y$3,0,AG39)","v":0},{"$f":"IF(AH39>$Y$3,0,AH39)","v":0},{"$f":"IF(AI39>$Y$3,0,AI39)","v":0},{"$f":"IF(AJ39>$Y$3,0,AJ39)","v":0},{"$f":"IF(AK39>$Y$3,0,AK39)","v":0},{"$f":"IF(AL39>$Y$3,0,AL39)","v":0},{"$f":"IF(AM39>$Y$3,0,AM39)","v":0},{"$f":"IF(AN39>$Y$3,0,AN39)","v":0},{"$f":"IF(AO39>$Y$3,0,AO39)","v":0},{"$f":"IF(AP39>$Y$3,0,AP39)","v":0},{"$f":"IF(AQ39>$Y$3,0,AQ39)","v":0},{"$f":"IF(AR39>$Y$3,0,AR39)","v":0},{"$f":"IF(AS39>$Y$3,0,AS39)","v":0},{"$f":"IF(AT39>$Y$3,0,AT39)","v":0},{"$f":"IF(AU39>$Y$3,0,AU39)","v":0},{"$f":"IF(AV39>$Y$3,0,AV39)","v":0},{"$f":"IF(AW39>$Y$3,0,AW39)","v":0},{"$f":"IF(AX39>$Y$3,0,AX39)","v":0},{"$f":"IF(AY39>$Y$3,0,AY39)","v":0},{"$f":"IF(AZ39>$Y$3,0,AZ39)","v":0},{"$f":"IF(BA39>$Y$3,0,BA39)","v":0},{"$f":"IF(BB39>$Y$3,0,BB39)","v":0},{"$f":"IF(BC39>$Y$3,0,BC39)","v":0},{"$f":"IF(BD39>$Y$3,0,BD39)","v":0},{"$f":"IF(BE39>$Y$3,0,BE39)","v":0},{"$f":"IF(#REF!>$Y$3,0,#REF!)","v":{"$error":"#REF!"}},{"$f":"IF(#REF!>$Y$3,0,#REF!)","v":{"$error":"#REF!"}},{"$f":"IF(#REF!>$Y$3,0,#REF!)","v":{"$error":"#REF!"}},{"$f":"IF(#REF!>$Y$3,0,#REF!)","v":{"$error":"#REF!"}},{"$f":"IF(#REF!>$Y$3,0,#REF!)","v":{"$error":"#REF!"}},{"$f":"IF(#REF!>$Y$3,0,#REF!)","v":{"$error":"#REF!"}},{"$f":"IF(#REF!>$Y$3,0,#REF!)","v":{"$error":"#REF!"}},{"$f":"IF(#REF!>$Y$3,0,#REF!)","v":{"$error":"#REF!"}},{"$f":"IF(#REF!>$Y$3,0,#REF!)","v":{"$error":"#REF!"}},{"$f":"IF(#REF!>$Y$3,0,#REF!)","v":{"$error":"#REF!"}},{"$f":"IF(#REF!>$Y$3,0,#REF!)","v":{"$error":"#REF!"}},{"$f":"IF(#REF!>$Y$3,0,#REF!)","v":{"$error":"#REF!"}},{"$f":"IF(#REF!>$Y$3,0,#REF!)","v":{"$error":"#REF!"}},{"$f":"IF(#REF!>$Y$3,0,#REF!)","v":{"$error":"#REF!"}},{"$f":"IF(#REF!>$Y$3,0,#REF!)","v":{"$error":"#REF!"}},{"$f":"IF(#REF!>$Y$3,0,#REF!)","v":{"$error":"#REF!"}},{"$f":"IF(#REF!>$Y$3,0,#REF!)","v":{"$error":"#REF!"}},{"$f":"IF(#REF!>$Y$3,0,#REF!)","v":{"$error":"#REF!"}},{"$f":"IF(#REF!>$Y$3,0,#REF!)","v":{"$error":"#REF!"}},{"$f":"IF(#REF!>$Y$3,0,#REF!)","v":{"$error":"#REF!"}},{"$f":"IF(#REF!>$Y$3,0,#REF!)","v":{"$error":"#REF!"}},{"$f":"IF(#REF!>$Y$3,0,#REF!)","v":{"$error":"#REF!"}},{"$f":"IF(#REF!>$Y$3,0,#REF!)","v":{"$error":"#REF!"}},{"$f":"IF(#REF!>$Y$3,0,#REF!)","v":{"$error":"#REF!"}},{"$f":"IF(#REF!>$Y$3,0,#REF!)","v":{"$error":"#REF!"}},{"$f":"IF(#REF!>$Y$3,0,#REF!)","v":{"$error":"#REF!"}},{"$f":"IF(#REF!>$Y$3,0,#REF!)","v":{"$error":"#REF!"}},{"$f":"IF(#REF!>$Y$3,0,#REF!)","v":{"$error":"#REF!"}}]
[null,null,36,null,null,null,null,null,null,null,null,null,null,null,null,null,null,null,null,null,null,null,null,null,null,null,null,null,null,null,null,null,null,null,null,null,null,null,null,null,null,null,null,null,null,null,null,null,null,null,null,null,null,null,null,null,null,0,{"$f":"IF(PARCIAL1!L$8=0,0,(ROUND(((BF40*10)/PARCIAL1!L$8),1)))","v":0},null,null,0,0,0,0,0,0,0,0,0,0,0,0,0,0,0,0,0,0,0,0,0,0,0,0,0,0,0,0,0,0,0,0,0,0,0,0,0,0,0,0,0,0,0,0,0,0,0,0,0,0,0,0,{"$f":"IF(#REF!>$Y$3,0,#REF!)","v":{"$error":"#REF!"}},{"$f":"IF(#REF!>$Y$3,0,#REF!)","v":{"$error":"#REF!"}},{"$f":"IF(#REF!>$Y$3,0,#REF!)","v":{"$error":"#REF!"}},{"$f":"IF(#REF!>$Y$3,0,#REF!)","v":{"$error":"#REF!"}},{"$f":"IF(#REF!>$Y$3,0,#REF!)","v":{"$error":"#REF!"}},{"$f":"IF(#REF!>$Y$3,0,#REF!)","v":{"$error":"#REF!"}},{"$f":"IF(#REF!>$Y$3,0,#REF!)","v":{"$error":"#REF!"}},{"$f":"IF(#REF!>$Y$3,0,#REF!)","v":{"$error":"#REF!"}},{"$f":"IF(#REF!>$Y$3,0,#REF!)","v":{"$error":"#REF!"}},{"$f":"IF(#REF!>$Y$3,0,#REF!)","v":{"$error":"#REF!"}},{"$f":"IF(#REF!>$Y$3,0,#REF!)","v":{"$error":"#REF!"}},{"$f":"IF(#REF!>$Y$3,0,#REF!)","v":{"$error":"#REF!"}},{"$f":"IF(#REF!>$Y$3,0,#REF!)","v":{"$error":"#REF!"}},{"$f":"IF(#REF!>$Y$3,0,#REF!)","v":{"$error":"#REF!"}},{"$f":"IF(#REF!>$Y$3,0,#REF!)","v":{"$error":"#REF!"}},{"$f":"IF(#REF!>$Y$3,0,#REF!)","v":{"$error":"#REF!"}},{"$f":"IF(#REF!>$Y$3,0,#REF!)","v":{"$error":"#REF!"}},{"$f":"IF(#REF!>$Y$3,0,#REF!)","v":{"$error":"#REF!"}},{"$f":"IF(#REF!>$Y$3,0,#REF!)","v":{"$error":"#REF!"}},{"$f":"IF(#REF!>$Y$3,0,#REF!)","v":{"$error":"#REF!"}},{"$f":"IF(#REF!>$Y$3,0,#REF!)","v":{"$error":"#REF!"}},{"$f":"IF(#REF!>$Y$3,0,#REF!)","v":{"$error":"#REF!"}},{"$f":"IF(#REF!>$Y$3,0,#REF!)","v":{"$error":"#REF!"}},{"$f":"IF(#REF!>$Y$3,0,#REF!)","v":{"$error":"#REF!"}},{"$f":"IF(#REF!>$Y$3,0,#REF!)","v":{"$error":"#REF!"}},{"$f":"IF(#REF!>$Y$3,0,#REF!)","v":{"$error":"#REF!"}},{"$f":"IF(#REF!>$Y$3,0,#REF!)","v":{"$error":"#REF!"}},{"$f":"IF(#REF!>$Y$3,0,#REF!)","v":{"$error":"#REF!"}}]
[null,null,37,null,null,null,null,null,null,null,null,null,null,null,null,null,null,null,null,null,null,null,null,null,null,null,null,null,null,null,null,null,null,null,null,null,null,null,null,null,null,null,null,null,null,null,null,null,null,null,null,null,null,null,null,null,null,0,{"$f":"IF(PARCIAL1!L$8=0,0,(ROUND(((BF41*10)/PARCIAL1!L$8),1)))","v":0},null,null,0,0,0,0,0,0,0,0,0,0,0,0,0,0,0,0,0,0,0,0,0,0,0,0,0,0,0,0,0,0,0,0,0,0,0,0,0,0,0,0,0,0,0,0,0,0,0,0,0,0,0,0,{"$f":"IF(#REF!>$Y$3,0,#REF!)","v":{"$error":"#REF!"}},{"$f":"IF(#REF!>$Y$3,0,#REF!)","v":{"$error":"#REF!"}},{"$f":"IF(#REF!>$Y$3,0,#REF!)","v":{"$error":"#REF!"}},{"$f":"IF(#REF!>$Y$3,0,#REF!)","v":{"$error":"#REF!"}},{"$f":"IF(#REF!>$Y$3,0,#REF!)","v":{"$error":"#REF!"}},{"$f":"IF(#REF!>$Y$3,0,#REF!)","v":{"$error":"#REF!"}},{"$f":"IF(#REF!>$Y$3,0,#REF!)","v":{"$error":"#REF!"}},{"$f":"IF(#REF!>$Y$3,0,#REF!)","v":{"$error":"#REF!"}},{"$f":"IF(#REF!>$Y$3,0,#REF!)","v":{"$error":"#REF!"}},{"$f":"IF(#REF!>$Y$3,0,#REF!)","v":{"$error":"#REF!"}},{"$f":"IF(#REF!>$Y$3,0,#REF!)","v":{"$error":"#REF!"}},{"$f":"IF(#REF!>$Y$3,0,#REF!)","v":{"$error":"#REF!"}},{"$f":"IF(#REF!>$Y$3,0,#REF!)","v":{"$error":"#REF!"}},{"$f":"IF(#REF!>$Y$3,0,#REF!)","v":{"$error":"#REF!"}},{"$f":"IF(#REF!>$Y$3,0,#REF!)","v":{"$error":"#REF!"}},{"$f":"IF(#REF!>$Y$3,0,#REF!)","v":{"$error":"#REF!"}},{"$f":"IF(#REF!>$Y$3,0,#REF!)","v":{"$error":"#REF!"}},{"$f":"IF(#REF!>$Y$3,0,#REF!)","v":{"$error":"#REF!"}},{"$f":"IF(#REF!>$Y$3,0,#REF!)","v":{"$error":"#REF!"}},{"$f":"IF(#REF!>$Y$3,0,#REF!)","v":{"$error":"#REF!"}},{"$f":"IF(#REF!>$Y$3,0,#REF!)","v":{"$error":"#REF!"}},{"$f":"IF(#REF!>$Y$3,0,#REF!)","v":{"$error":"#REF!"}},{"$f":"IF(#REF!>$Y$3,0,#REF!)","v":{"$error":"#REF!"}},{"$f":"IF(#REF!>$Y$3,0,#REF!)","v":{"$error":"#REF!"}},{"$f":"IF(#REF!>$Y$3,0,#REF!)","v":{"$error":"#REF!"}},{"$f":"IF(#REF!>$Y$3,0,#REF!)","v":{"$error":"#REF!"}},{"$f":"IF(#REF!>$Y$3,0,#REF!)","v":{"$error":"#REF!"}},{"$f":"IF(#REF!>$Y$3,0,#REF!)","v":{"$error":"#REF!"}}]
[null,null,38,null,null,null,null,null,null,null,null,null,null,null,null,null,null,null,null,null,null,null,null,null,null,null,null,null,null,null,null,null,null,null,null,null,null,null,null,null,null,null,null,null,null,null,null,null,null,null,null,null,null,null,null,null,null,0,{"$f":"IF(PARCIAL1!L$8=0,0,(ROUND(((BF42*10)/PARCIAL1!L$8),1)))","v":0},null,null,0,0,0,0,0,0,0,0,0,0,0,0,0,0,0,0,0,0,0,0,0,0,0,0,0,0,0,0,0,0,0,0,0,0,0,0,0,0,0,0,0,0,0,0,0,0,0,0,0,0,0,0,{"$f":"IF(#REF!>$Y$3,0,#REF!)","v":{"$error":"#REF!"}},{"$f":"IF(#REF!>$Y$3,0,#REF!)","v":{"$error":"#REF!"}},{"$f":"IF(#REF!>$Y$3,0,#REF!)","v":{"$error":"#REF!"}},{"$f":"IF(#REF!>$Y$3,0,#REF!)","v":{"$error":"#REF!"}},{"$f":"IF(#REF!>$Y$3,0,#REF!)","v":{"$error":"#REF!"}},{"$f":"IF(#REF!>$Y$3,0,#REF!)","v":{"$error":"#REF!"}},{"$f":"IF(#REF!>$Y$3,0,#REF!)","v":{"$error":"#REF!"}},{"$f":"IF(#REF!>$Y$3,0,#REF!)","v":{"$error":"#REF!"}},{"$f":"IF(#REF!>$Y$3,0,#REF!)","v":{"$error":"#REF!"}},{"$f":"IF(#REF!>$Y$3,0,#REF!)","v":{"$error":"#REF!"}},{"$f":"IF(#REF!>$Y$3,0,#REF!)","v":{"$error":"#REF!"}},{"$f":"IF(#REF!>$Y$3,0,#REF!)","v":{"$error":"#REF!"}},{"$f":"IF(#REF!>$Y$3,0,#REF!)","v":{"$error":"#REF!"}},{"$f":"IF(#REF!>$Y$3,0,#REF!)","v":{"$error":"#REF!"}},{"$f":"IF(#REF!>$Y$3,0,#REF!)","v":{"$error":"#REF!"}},{"$f":"IF(#REF!>$Y$3,0,#REF!)","v":{"$error":"#REF!"}},{"$f":"IF(#REF!>$Y$3,0,#REF!)","v":{"$error":"#REF!"}},{"$f":"IF(#REF!>$Y$3,0,#REF!)","v":{"$error":"#REF!"}},{"$f":"IF(#REF!>$Y$3,0,#REF!)","v":{"$error":"#REF!"}},{"$f":"IF(#REF!>$Y$3,0,#REF!)","v":{"$error":"#REF!"}},{"$f":"IF(#REF!>$Y$3,0,#REF!)","v":{"$error":"#REF!"}},{"$f":"IF(#REF!>$Y$3,0,#REF!)","v":{"$error":"#REF!"}},{"$f":"IF(#REF!>$Y$3,0,#REF!)","v":{"$error":"#REF!"}},{"$f":"IF(#REF!>$Y$3,0,#REF!)","v":{"$error":"#REF!"}},{"$f":"IF(#REF!>$Y$3,0,#REF!)","v":{"$error":"#REF!"}},{"$f":"IF(#REF!>$Y$3,0,#REF!)","v":{"$error":"#REF!"}},{"$f":"IF(#REF!>$Y$3,0,#REF!)","v":{"$error":"#REF!"}},{"$f":"IF(#REF!>$Y$3,0,#REF!)","v":{"$error":"#REF!"}}]
[null,null,39,null,null,null,null,null,null,null,null,null,null,null,null,null,null,null,null,null,null,null,null,null,null,null,null,null,null,null,null,null,null,null,null,null,null,null,null,null,null,null,null,null,null,null,null,null,null,null,null,null,null,null,null,null,null,0,{"$f":"IF(PARCIAL1!L$8=0,0,(ROUND(((BF43*10)/PARCIAL1!L$8),1)))","v":0},null,null,0,0,0,0,0,0,0,0,0,0,0,0,0,0,0,0,0,0,0,0,0,0,0,0,0,0,0,0,0,0,0,0,0,0,0,0,0,0,0,0,0,0,0,0,0,0,0,0,0,0,0,0,{"$f":"IF(#REF!>$Y$3,0,#REF!)","v":{"$error":"#REF!"}},{"$f":"IF(#REF!>$Y$3,0,#REF!)","v":{"$error":"#REF!"}},{"$f":"IF(#REF!>$Y$3,0,#REF!)","v":{"$error":"#REF!"}},{"$f":"IF(#REF!>$Y$3,0,#REF!)","v":{"$error":"#REF!"}},{"$f":"IF(#REF!>$Y$3,0,#REF!)","v":{"$error":"#REF!"}},{"$f":"IF(#REF!>$Y$3,0,#REF!)","v":{"$error":"#REF!"}},{"$f":"IF(#REF!>$Y$3,0,#REF!)","v":{"$error":"#REF!"}},{"$f":"IF(#REF!>$Y$3,0,#REF!)","v":{"$error":"#REF!"}},{"$f":"IF(#REF!>$Y$3,0,#REF!)","v":{"$error":"#REF!"}},{"$f":"IF(#REF!>$Y$3,0,#REF!)","v":{"$error":"#REF!"}},{"$f":"IF(#REF!>$Y$3,0,#REF!)","v":{"$error":"#REF!"}},{"$f":"IF(#REF!>$Y$3,0,#REF!)","v":{"$error":"#REF!"}},{"$f":"IF(#REF!>$Y$3,0,#REF!)","v":{"$error":"#REF!"}},{"$f":"IF(#REF!>$Y$3,0,#REF!)","v":{"$error":"#REF!"}},{"$f":"IF(#REF!>$Y$3,0,#REF!)","v":{"$error":"#REF!"}},{"$f":"IF(#REF!>$Y$3,0,#REF!)","v":{"$error":"#REF!"}},{"$f":"IF(#REF!>$Y$3,0,#REF!)","v":{"$error":"#REF!"}},{"$f":"IF(#REF!>$Y$3,0,#REF!)","v":{"$error":"#REF!"}},{"$f":"IF(#REF!>$Y$3,0,#REF!)","v":{"$error":"#REF!"}},{"$f":"IF(#REF!>$Y$3,0,#REF!)","v":{"$error":"#REF!"}},{"$f":"IF(#REF!>$Y$3,0,#REF!)","v":{"$error":"#REF!"}},{"$f":"IF(#REF!>$Y$3,0,#REF!)","v":{"$error":"#REF!"}},{"$f":"IF(#REF!>$Y$3,0,#REF!)","v":{"$error":"#REF!"}},{"$f":"IF(#REF!>$Y$3,0,#REF!)","v":{"$error":"#REF!"}},{"$f":"IF(#REF!>$Y$3,0,#REF!)","v":{"$error":"#REF!"}},{"$f":"IF(#REF!>$Y$3,0,#REF!)","v":{"$error":"#REF!"}},{"$f":"IF(#REF!>$Y$3,0,#REF!)","v":{"$error":"#REF!"}},{"$f":"IF(#REF!>$Y$3,0,#REF!)","v":{"$error":"#REF!"}}]
[null,null,40,null,null,null,null,null,null,null,null,null,null,null,null,null,null,null,null,null,null,null,null,null,null,null,null,null,null,null,null,null,null,null,null,null,null,null,null,null,null,null,null,null,null,null,null,null,null,null,null,null,null,null,null,null,null,0,{"$f":"IF(PARCIAL1!L$8=0,0,(ROUND(((BF44*10)/PARCIAL1!L$8),1)))","v":0},null,null,0,0,0,0,0,0,0,0,0,0,0,0,0,0,0,0,0,0,0,0,0,0,0,0,0,0,0,0,0,0,0,0,0,0,0,0,0,0,0,0,0,0,0,0,0,0,0,0,0,0,0,0,{"$f":"IF(#REF!>$Y$3,0,#REF!)","v":{"$error":"#REF!"}},{"$f":"IF(#REF!>$Y$3,0,#REF!)","v":{"$error":"#REF!"}},{"$f":"IF(#REF!>$Y$3,0,#REF!)","v":{"$error":"#REF!"}},{"$f":"IF(#REF!>$Y$3,0,#REF!)","v":{"$error":"#REF!"}},{"$f":"IF(#REF!>$Y$3,0,#REF!)","v":{"$error":"#REF!"}},{"$f":"IF(#REF!>$Y$3,0,#REF!)","v":{"$error":"#REF!"}},{"$f":"IF(#REF!>$Y$3,0,#REF!)","v":{"$error":"#REF!"}},{"$f":"IF(#REF!>$Y$3,0,#REF!)","v":{"$error":"#REF!"}},{"$f":"IF(#REF!>$Y$3,0,#REF!)","v":{"$error":"#REF!"}},{"$f":"IF(#REF!>$Y$3,0,#REF!)","v":{"$error":"#REF!"}},{"$f":"IF(#REF!>$Y$3,0,#REF!)","v":{"$error":"#REF!"}},{"$f":"IF(#REF!>$Y$3,0,#REF!)","v":{"$error":"#REF!"}},{"$f":"IF(#REF!>$Y$3,0,#REF!)","v":{"$error":"#REF!"}},{"$f":"IF(#REF!>$Y$3,0,#REF!)","v":{"$error":"#REF!"}},{"$f":"IF(#REF!>$Y$3,0,#REF!)","v":{"$error":"#REF!"}},{"$f":"IF(#REF!>$Y$3,0,#REF!)","v":{"$error":"#REF!"}},{"$f":"IF(#REF!>$Y$3,0,#REF!)","v":{"$error":"#REF!"}},{"$f":"IF(#REF!>$Y$3,0,#REF!)","v":{"$error":"#REF!"}},{"$f":"IF(#REF!>$Y$3,0,#REF!)","v":{"$error":"#REF!"}},{"$f":"IF(#REF!>$Y$3,0,#REF!)","v":{"$error":"#REF!"}},{"$f":"IF(#REF!>$Y$3,0,#REF!)","v":{"$error":"#REF!"}},{"$f":"IF(#REF!>$Y$3,0,#REF!)","v":{"$error":"#REF!"}},{"$f":"IF(#REF!>$Y$3,0,#REF!)","v":{"$error":"#REF!"}},{"$f":"IF(#REF!>$Y$3,0,#REF!)","v":{"$error":"#REF!"}},{"$f":"IF(#REF!>$Y$3,0,#REF!)","v":{"$error":"#REF!"}},{"$f":"IF(#REF!>$Y$3,0,#REF!)","v":{"$error":"#REF!"}},{"$f":"IF(#REF!>$Y$3,0,#REF!)","v":{"$error":"#REF!"}},{"$f":"IF(#REF!>$Y$3,0,#REF!)","v":{"$error":"#REF!"}}]
[null,null,41,null,null,null,null,null,null,null,null,null,null,null,null,null,null,null,null,null,null,null,null,null,null,null,null,null,null,null,null,null,null,null,null,null,null,null,null,null,null,null,null,null,null,null,null,null,null,null,null,null,null,null,null,null,null,0,{"$f":"IF(PARCIAL1!L$8=0,0,(ROUND(((BF45*10)/PARCIAL1!L$8),1)))","v":0},null,null,0,0,0,0,0,0,0,0,0,0,0,0,0,0,0,0,0,0,0,0,0,0,0,0,0,0,0,0,0,0,0,0,0,0,0,0,0,0,0,0,0,0,0,0,0,0,0,0,0,0,0,0,{"$f":"IF(#REF!>$Y$3,0,#REF!)","v":{"$error":"#REF!"}},{"$f":"IF(#REF!>$Y$3,0,#REF!)","v":{"$error":"#REF!"}},{"$f":"IF(#REF!>$Y$3,0,#REF!)","v":{"$error":"#REF!"}},{"$f":"IF(#REF!>$Y$3,0,#REF!)","v":{"$error":"#REF!"}},{"$f":"IF(#REF!>$Y$3,0,#REF!)","v":{"$error":"#REF!"}},{"$f":"IF(#REF!>$Y$3,0,#REF!)","v":{"$error":"#REF!"}},{"$f":"IF(#REF!>$Y$3,0,#REF!)","v":{"$error":"#REF!"}},{"$f":"IF(#REF!>$Y$3,0,#REF!)","v":{"$error":"#REF!"}},{"$f":"IF(#REF!>$Y$3,0,#REF!)","v":{"$error":"#REF!"}},{"$f":"IF(#REF!>$Y$3,0,#REF!)","v":{"$error":"#REF!"}},{"$f":"IF(#REF!>$Y$3,0,#REF!)","v":{"$error":"#REF!"}},{"$f":"IF(#REF!>$Y$3,0,#REF!)","v":{"$error":"#REF!"}},{"$f":"IF(#REF!>$Y$3,0,#REF!)","v":{"$error":"#REF!"}},{"$f":"IF(#REF!>$Y$3,0,#REF!)","v":{"$error":"#REF!"}},{"$f":"IF(#REF!>$Y$3,0,#REF!)","v":{"$error":"#REF!"}},{"$f":"IF(#REF!>$Y$3,0,#REF!)","v":{"$error":"#REF!"}},{"$f":"IF(#REF!>$Y$3,0,#REF!)","v":{"$error":"#REF!"}},{"$f":"IF(#REF!>$Y$3,0,#REF!)","v":{"$error":"#REF!"}},{"$f":"IF(#REF!>$Y$3,0,#REF!)","v":{"$error":"#REF!"}},{"$f":"IF(#REF!>$Y$3,0,#REF!)","v":{"$error":"#REF!"}},{"$f":"IF(#REF!>$Y$3,0,#REF!)","v":{"$error":"#REF!"}},{"$f":"IF(#REF!>$Y$3,0,#REF!)","v":{"$error":"#REF!"}},{"$f":"IF(#REF!>$Y$3,0,#REF!)","v":{"$error":"#REF!"}},{"$f":"IF(#REF!>$Y$3,0,#REF!)","v":{"$error":"#REF!"}},{"$f":"IF(#REF!>$Y$3,0,#REF!)","v":{"$error":"#REF!"}},{"$f":"IF(#REF!>$Y$3,0,#REF!)","v":{"$error":"#REF!"}},{"$f":"IF(#REF!>$Y$3,0,#REF!)","v":{"$error":"#REF!"}},{"$f":"IF(#REF!>$Y$3,0,#REF!)","v":{"$error":"#REF!"}}]
[null,null,42,null,null,null,null,null,null,null,null,null,null,null,null,null,null,null,null,null,null,null,null,null,null,null,null,null,null,null,null,null,null,null,null,null,null,null,null,null,null,null,null,null,null,null,null,null,null,null,null,null,null,null,null,null,null,0,{"$f":"IF(PARCIAL1!L$8=0,0,(ROUND(((BF46*10)/PARCIAL1!L$8),1)))","v":0},null,null,0,0,0,0,0,0,0,0,0,0,0,0,0,0,0,0,0,0,0,0,0,0,0,0,0,0,0,0,0,0,0,0,0,0,0,0,0,0,0,0,0,0,0,0,0,0,0,0,0,0,0,0,{"$f":"IF(#REF!>$Y$3,0,#REF!)","v":{"$error":"#REF!"}},{"$f":"IF(#REF!>$Y$3,0,#REF!)","v":{"$error":"#REF!"}},{"$f":"IF(#REF!>$Y$3,0,#REF!)","v":{"$error":"#REF!"}},{"$f":"IF(#REF!>$Y$3,0,#REF!)","v":{"$error":"#REF!"}},{"$f":"IF(#REF!>$Y$3,0,#REF!)","v":{"$error":"#REF!"}},{"$f":"IF(#REF!>$Y$3,0,#REF!)","v":{"$error":"#REF!"}},{"$f":"IF(#REF!>$Y$3,0,#REF!)","v":{"$error":"#REF!"}},{"$f":"IF(#REF!>$Y$3,0,#REF!)","v":{"$error":"#REF!"}},{"$f":"IF(#REF!>$Y$3,0,#REF!)","v":{"$error":"#REF!"}},{"$f":"IF(#REF!>$Y$3,0,#REF!)","v":{"$error":"#REF!"}},{"$f":"IF(#REF!>$Y$3,0,#REF!)","v":{"$error":"#REF!"}},{"$f":"IF(#REF!>$Y$3,0,#REF!)","v":{"$error":"#REF!"}},{"$f":"IF(#REF!>$Y$3,0,#REF!)","v":{"$error":"#REF!"}},{"$f":"IF(#REF!>$Y$3,0,#REF!)","v":{"$error":"#REF!"}},{"$f":"IF(#REF!>$Y$3,0,#REF!)","v":{"$error":"#REF!"}},{"$f":"IF(#REF!>$Y$3,0,#REF!)","v":{"$error":"#REF!"}},{"$f":"IF(#REF!>$Y$3,0,#REF!)","v":{"$error":"#REF!"}},{"$f":"IF(#REF!>$Y$3,0,#REF!)","v":{"$error":"#REF!"}},{"$f":"IF(#REF!>$Y$3,0,#REF!)","v":{"$error":"#REF!"}},{"$f":"IF(#REF!>$Y$3,0,#REF!)","v":{"$error":"#REF!"}},{"$f":"IF(#REF!>$Y$3,0,#REF!)","v":{"$error":"#REF!"}},{"$f":"IF(#REF!>$Y$3,0,#REF!)","v":{"$error":"#REF!"}},{"$f":"IF(#REF!>$Y$3,0,#REF!)","v":{"$error":"#REF!"}},{"$f":"IF(#REF!>$Y$3,0,#REF!)","v":{"$error":"#REF!"}},{"$f":"IF(#REF!>$Y$3,0,#REF!)","v":{"$error":"#REF!"}},{"$f":"IF(#REF!>$Y$3,0,#REF!)","v":{"$error":"#REF!"}},{"$f":"IF(#REF!>$Y$3,0,#REF!)","v":{"$error":"#REF!"}},{"$f":"IF(#REF!>$Y$3,0,#REF!)","v":{"$error":"#REF!"}}]
[null,null,43,null,null,null,null,null,null,null,null,null,null,null,null,null,null,null,null,null,null,null,null,null,null,null,null,null,null,null,null,null,null,null,null,null,null,null,null,null,null,null,null,null,null,null,null,null,null,null,null,null,null,null,null,null,null,0,{"$f":"IF(PARCIAL1!L$8=0,0,(ROUND(((BF47*10)/PARCIAL1!L$8),1)))","v":0},null,null,0,0,0,0,0,0,0,0,0,0,0,0,0,0,0,0,0,0,0,0,0,0,0,0,0,0,0,0,0,0,0,0,0,0,0,0,0,0,0,0,0,0,0,0,0,0,0,0,0,0,0,0,{"$f":"IF(#REF!>$Y$3,0,#REF!)","v":{"$error":"#REF!"}},{"$f":"IF(#REF!>$Y$3,0,#REF!)","v":{"$error":"#REF!"}},{"$f":"IF(#REF!>$Y$3,0,#REF!)","v":{"$error":"#REF!"}},{"$f":"IF(#REF!>$Y$3,0,#REF!)","v":{"$error":"#REF!"}},{"$f":"IF(#REF!>$Y$3,0,#REF!)","v":{"$error":"#REF!"}},{"$f":"IF(#REF!>$Y$3,0,#REF!)","v":{"$error":"#REF!"}},{"$f":"IF(#REF!>$Y$3,0,#REF!)","v":{"$error":"#REF!"}},{"$f":"IF(#REF!>$Y$3,0,#REF!)","v":{"$error":"#REF!"}},{"$f":"IF(#REF!>$Y$3,0,#REF!)","v":{"$error":"#REF!"}},{"$f":"IF(#REF!>$Y$3,0,#REF!)","v":{"$error":"#REF!"}},{"$f":"IF(#REF!>$Y$3,0,#REF!)","v":{"$error":"#REF!"}},{"$f":"IF(#REF!>$Y$3,0,#REF!)","v":{"$error":"#REF!"}},{"$f":"IF(#REF!>$Y$3,0,#REF!)","v":{"$error":"#REF!"}},{"$f":"IF(#REF!>$Y$3,0,#REF!)","v":{"$error":"#REF!"}},{"$f":"IF(#REF!>$Y$3,0,#REF!)","v":{"$error":"#REF!"}},{"$f":"IF(#REF!>$Y$3,0,#REF!)","v":{"$error":"#REF!"}},{"$f":"IF(#REF!>$Y$3,0,#REF!)","v":{"$error":"#REF!"}},{"$f":"IF(#REF!>$Y$3,0,#REF!)","v":{"$error":"#REF!"}},{"$f":"IF(#REF!>$Y$3,0,#REF!)","v":{"$error":"#REF!"}},{"$f":"IF(#REF!>$Y$3,0,#REF!)","v":{"$error":"#REF!"}},{"$f":"IF(#REF!>$Y$3,0,#REF!)","v":{"$error":"#REF!"}},{"$f":"IF(#REF!>$Y$3,0,#REF!)","v":{"$error":"#REF!"}},{"$f":"IF(#REF!>$Y$3,0,#REF!)","v":{"$error":"#REF!"}},{"$f":"IF(#REF!>$Y$3,0,#REF!)","v":{"$error":"#REF!"}},{"$f":"IF(#REF!>$Y$3,0,#REF!)","v":{"$error":"#REF!"}},{"$f":"IF(#REF!>$Y$3,0,#REF!)","v":{"$error":"#REF!"}},{"$f":"IF(#REF!>$Y$3,0,#REF!)","v":{"$error":"#REF!"}},{"$f":"IF(#REF!>$Y$3,0,#REF!)","v":{"$error":"#REF!"}}]
[null,null,44,null,null,null,null,null,null,null,null,null,null,null,null,null,null,null,null,null,null,null,null,null,null,null,null,null,null,null,null,null,null,null,null,null,null,null,null,null,null,null,null,null,null,null,null,null,null,null,null,null,null,null,null,null,null,0,{"$f":"IF(PARCIAL1!L$8=0,0,(ROUND(((BF48*10)/PARCIAL1!L$8),1)))","v":0},null,null,0,0,0,0,0,0,0,0,0,0,0,0,0,0,0,0,0,0,0,0,0,0,0,0,0,0,0,0,0,0,0,0,0,0,0,0,0,0,0,0,0,0,0,0,0,0,0,0,0,0,0,0,{"$f":"IF(#REF!>$Y$3,0,#REF!)","v":{"$error":"#REF!"}},{"$f":"IF(#REF!>$Y$3,0,#REF!)","v":{"$error":"#REF!"}},{"$f":"IF(#REF!>$Y$3,0,#REF!)","v":{"$error":"#REF!"}},{"$f":"IF(#REF!>$Y$3,0,#REF!)","v":{"$error":"#REF!"}},{"$f":"IF(#REF!>$Y$3,0,#REF!)","v":{"$error":"#REF!"}},{"$f":"IF(#REF!>$Y$3,0,#REF!)","v":{"$error":"#REF!"}},{"$f":"IF(#REF!>$Y$3,0,#REF!)","v":{"$error":"#REF!"}},{"$f":"IF(#REF!>$Y$3,0,#REF!)","v":{"$error":"#REF!"}},{"$f":"IF(#REF!>$Y$3,0,#REF!)","v":{"$error":"#REF!"}},{"$f":"IF(#REF!>$Y$3,0,#REF!)","v":{"$error":"#REF!"}},{"$f":"IF(#REF!>$Y$3,0,#REF!)","v":{"$error":"#REF!"}},{"$f":"IF(#REF!>$Y$3,0,#REF!)","v":{"$error":"#REF!"}},{"$f":"IF(#REF!>$Y$3,0,#REF!)","v":{"$error":"#REF!"}},{"$f":"IF(#REF!>$Y$3,0,#REF!)","v":{"$error":"#REF!"}},{"$f":"IF(#REF!>$Y$3,0,#REF!)","v":{"$error":"#REF!"}},{"$f":"IF(#REF!>$Y$3,0,#REF!)","v":{"$error":"#REF!"}},{"$f":"IF(#REF!>$Y$3,0,#REF!)","v":{"$error":"#REF!"}},{"$f":"IF(#REF!>$Y$3,0,#REF!)","v":{"$error":"#REF!"}},{"$f":"IF(#REF!>$Y$3,0,#REF!)","v":{"$error":"#REF!"}},{"$f":"IF(#REF!>$Y$3,0,#REF!)","v":{"$error":"#REF!"}},{"$f":"IF(#REF!>$Y$3,0,#REF!)","v":{"$error":"#REF!"}},{"$f":"IF(#REF!>$Y$3,0,#REF!)","v":{"$error":"#REF!"}},{"$f":"IF(#REF!>$Y$3,0,#REF!)","v":{"$error":"#REF!"}},{"$f":"IF(#REF!>$Y$3,0,#REF!)","v":{"$error":"#REF!"}},{"$f":"IF(#REF!>$Y$3,0,#REF!)","v":{"$error":"#REF!"}},{"$f":"IF(#REF!>$Y$3,0,#REF!)","v":{"$error":"#REF!"}},{"$f":"IF(#REF!>$Y$3,0,#REF!)","v":{"$error":"#REF!"}},{"$f":"IF(#REF!>$Y$3,0,#REF!)","v":{"$error":"#REF!"}}]
[null,null,45,null,null,null,null,null,null,null,null,null,null,null,null,null,null,null,null,null,null,null,null,null,null,null,null,null,null,null,null,null,null,null,null,null,null,null,null,null,null,null,null,null,null,null,null,null,null,null,null,null,null,null,null,null,null,0,{"$f":"IF(PARCIAL1!L$8=0,0,(ROUND(((BF49*10)/PARCIAL1!L$8),1)))","v":0},null,null,0,0,0,0,0,0,0,0,0,0,0,0,0,0,0,0,0,0,0,0,0,0,0,0,0,0,0,0,0,0,0,0,0,0,0,0,0,0,0,0,0,0,0,0,0,0,0,0,0,0,0,0,{"$f":"IF(#REF!>$Y$3,0,#REF!)","v":{"$error":"#REF!"}},{"$f":"IF(#REF!>$Y$3,0,#REF!)","v":{"$error":"#REF!"}},{"$f":"IF(#REF!>$Y$3,0,#REF!)","v":{"$error":"#REF!"}},{"$f":"IF(#REF!>$Y$3,0,#REF!)","v":{"$error":"#REF!"}},{"$f":"IF(#REF!>$Y$3,0,#REF!)","v":{"$error":"#REF!"}},{"$f":"IF(#REF!>$Y$3,0,#REF!)","v":{"$error":"#REF!"}},{"$f":"IF(#REF!>$Y$3,0,#REF!)","v":{"$error":"#REF!"}},{"$f":"IF(#REF!>$Y$3,0,#REF!)","v":{"$error":"#REF!"}},{"$f":"IF(#REF!>$Y$3,0,#REF!)","v":{"$error":"#REF!"}},{"$f":"IF(#REF!>$Y$3,0,#REF!)","v":{"$error":"#REF!"}},{"$f":"IF(#REF!>$Y$3,0,#REF!)","v":{"$error":"#REF!"}},{"$f":"IF(#REF!>$Y$3,0,#REF!)","v":{"$error":"#REF!"}},{"$f":"IF(#REF!>$Y$3,0,#REF!)","v":{"$error":"#REF!"}},{"$f":"IF(#REF!>$Y$3,0,#REF!)","v":{"$error":"#REF!"}},{"$f":"IF(#REF!>$Y$3,0,#REF!)","v":{"$error":"#REF!"}},{"$f":"IF(#REF!>$Y$3,0,#REF!)","v":{"$error":"#REF!"}},{"$f":"IF(#REF!>$Y$3,0,#REF!)","v":{"$error":"#REF!"}},{"$f":"IF(#REF!>$Y$3,0,#REF!)","v":{"$error":"#REF!"}},{"$f":"IF(#REF!>$Y$3,0,#REF!)","v":{"$error":"#REF!"}},{"$f":"IF(#REF!>$Y$3,0,#REF!)","v":{"$error":"#REF!"}},{"$f":"IF(#REF!>$Y$3,0,#REF!)","v":{"$error":"#REF!"}},{"$f":"IF(#REF!>$Y$3,0,#REF!)","v":{"$error":"#REF!"}},{"$f":"IF(#REF!>$Y$3,0,#REF!)","v":{"$error":"#REF!"}},{"$f":"IF(#REF!>$Y$3,0,#REF!)","v":{"$error":"#REF!"}},{"$f":"IF(#REF!>$Y$3,0,#REF!)","v":{"$error":"#REF!"}},{"$f":"IF(#REF!>$Y$3,0,#REF!)","v":{"$error":"#REF!"}},{"$f":"IF(#REF!>$Y$3,0,#REF!)","v":{"$error":"#REF!"}},{"$f":"IF(#REF!>$Y$3,0,#REF!)","v":{"$error":"#REF!"}}]
[null,null,46,null,null,null,null,null,null,null,null,null,null,null,null,null,null,null,null,null,null,null,null,null,null,null,null,null,null,null,null,null,null,null,null,null,null,null,null,null,null,null,null,null,null,null,null,null,null,null,null,null,null,null,null,null,null,0,{"$f":"IF(PARCIAL1!L$8=0,0,(ROUND(((BF50*10)/PARCIAL1!L$8),1)))","v":0},null,null,0,0,0,0,0,0,0,0,0,0,0,0,0,0,0,0,0,0,0,0,0,0,0,0,0,0,0,0,0,0,0,0,0,0,0,0,0,0,0,0,0,0,0,0,0,0,0,0,0,0,0,0,{"$f":"IF(#REF!>$Y$3,0,#REF!)","v":{"$error":"#REF!"}},{"$f":"IF(#REF!>$Y$3,0,#REF!)","v":{"$error":"#REF!"}},{"$f":"IF(#REF!>$Y$3,0,#REF!)","v":{"$error":"#REF!"}},{"$f":"IF(#REF!>$Y$3,0,#REF!)","v":{"$error":"#REF!"}},{"$f":"IF(#REF!>$Y$3,0,#REF!)","v":{"$error":"#REF!"}},{"$f":"IF(#REF!>$Y$3,0,#REF!)","v":{"$error":"#REF!"}},{"$f":"IF(#REF!>$Y$3,0,#REF!)","v":{"$error":"#REF!"}},{"$f":"IF(#REF!>$Y$3,0,#REF!)","v":{"$error":"#REF!"}},{"$f":"IF(#REF!>$Y$3,0,#REF!)","v":{"$error":"#REF!"}},{"$f":"IF(#REF!>$Y$3,0,#REF!)","v":{"$error":"#REF!"}},{"$f":"IF(#REF!>$Y$3,0,#REF!)","v":{"$error":"#REF!"}},{"$f":"IF(#REF!>$Y$3,0,#REF!)","v":{"$error":"#REF!"}},{"$f":"IF(#REF!>$Y$3,0,#REF!)","v":{"$error":"#REF!"}},{"$f":"IF(#REF!>$Y$3,0,#REF!)","v":{"$error":"#REF!"}},{"$f":"IF(#REF!>$Y$3,0,#REF!)","v":{"$error":"#REF!"}},{"$f":"IF(#REF!>$Y$3,0,#REF!)","v":{"$error":"#REF!"}},{"$f":"IF(#REF!>$Y$3,0,#REF!)","v":{"$error":"#REF!"}},{"$f":"IF(#REF!>$Y$3,0,#REF!)","v":{"$error":"#REF!"}},{"$f":"IF(#REF!>$Y$3,0,#REF!)","v":{"$error":"#REF!"}},{"$f":"IF(#REF!>$Y$3,0,#REF!)","v":{"$error":"#REF!"}},{"$f":"IF(#REF!>$Y$3,0,#REF!)","v":{"$error":"#REF!"}},{"$f":"IF(#REF!>$Y$3,0,#REF!)","v":{"$error":"#REF!"}},{"$f":"IF(#REF!>$Y$3,0,#REF!)","v":{"$error":"#REF!"}},{"$f":"IF(#REF!>$Y$3,0,#REF!)","v":{"$error":"#REF!"}},{"$f":"IF(#REF!>$Y$3,0,#REF!)","v":{"$error":"#REF!"}},{"$f":"IF(#REF!>$Y$3,0,#REF!)","v":{"$error":"#REF!"}},{"$f":"IF(#REF!>$Y$3,0,#REF!)","v":{"$error":"#REF!"}},{"$f":"IF(#REF!>$Y$3,0,#REF!)","v":{"$error":"#REF!"}}]
[null,null,47,null,null,null,null,null,null,null,null,null,null,null,null,null,null,null,null,null,null,null,null,null,null,null,null,null,null,null,null,null,null,null,null,null,null,null,null,null,null,null,null,null,null,null,null,null,null,null,null,null,null,null,null,null,null,0,{"$f":"IF(PARCIAL1!L$8=0,0,(ROUND(((BF51*10)/PARCIAL1!L$8),1)))","v":0},null,null,0,0,0,0,0,0,0,0,0,0,0,0,0,0,0,0,0,0,0,0,0,0,0,0,0,0,0,0,0,0,0,0,0,0,0,0,0,0,0,0,0,0,0,0,0,0,0,0,0,0,0,0,{"$f":"IF(#REF!>$Y$3,0,#REF!)","v":{"$error":"#REF!"}},{"$f":"IF(#REF!>$Y$3,0,#REF!)","v":{"$error":"#REF!"}},{"$f":"IF(#REF!>$Y$3,0,#REF!)","v":{"$error":"#REF!"}},{"$f":"IF(#REF!>$Y$3,0,#REF!)","v":{"$error":"#REF!"}},{"$f":"IF(#REF!>$Y$3,0,#REF!)","v":{"$error":"#REF!"}},{"$f":"IF(#REF!>$Y$3,0,#REF!)","v":{"$error":"#REF!"}},{"$f":"IF(#REF!>$Y$3,0,#REF!)","v":{"$error":"#REF!"}},{"$f":"IF(#REF!>$Y$3,0,#REF!)","v":{"$error":"#REF!"}},{"$f":"IF(#REF!>$Y$3,0,#REF!)","v":{"$error":"#REF!"}},{"$f":"IF(#REF!>$Y$3,0,#REF!)","v":{"$error":"#REF!"}},{"$f":"IF(#REF!>$Y$3,0,#REF!)","v":{"$error":"#REF!"}},{"$f":"IF(#REF!>$Y$3,0,#REF!)","v":{"$error":"#REF!"}},{"$f":"IF(#REF!>$Y$3,0,#REF!)","v":{"$error":"#REF!"}},{"$f":"IF(#REF!>$Y$3,0,#REF!)","v":{"$error":"#REF!"}},{"$f":"IF(#REF!>$Y$3,0,#REF!)","v":{"$error":"#REF!"}},{"$f":"IF(#REF!>$Y$3,0,#REF!)","v":{"$error":"#REF!"}},{"$f":"IF(#REF!>$Y$3,0,#REF!)","v":{"$error":"#REF!"}},{"$f":"IF(#REF!>$Y$3,0,#REF!)","v":{"$error":"#REF!"}},{"$f":"IF(#REF!>$Y$3,0,#REF!)","v":{"$error":"#REF!"}},{"$f":"IF(#REF!>$Y$3,0,#REF!)","v":{"$error":"#REF!"}},{"$f":"IF(#REF!>$Y$3,0,#REF!)","v":{"$error":"#REF!"}},{"$f":"IF(#REF!>$Y$3,0,#REF!)","v":{"$error":"#REF!"}},{"$f":"IF(#REF!>$Y$3,0,#REF!)","v":{"$error":"#REF!"}},{"$f":"IF(#REF!>$Y$3,0,#REF!)","v":{"$error":"#REF!"}},{"$f":"IF(#REF!>$Y$3,0,#REF!)","v":{"$error":"#REF!"}},{"$f":"IF(#REF!>$Y$3,0,#REF!)","v":{"$error":"#REF!"}},{"$f":"IF(#REF!>$Y$3,0,#REF!)","v":{"$error":"#REF!"}},{"$f":"IF(#REF!>$Y$3,0,#REF!)","v":{"$error":"#REF!"}}]
[null,null,48,null,null,null,null,null,null,null,null,null,null,null,null,null,null,null,null,null,null,null,null,null,null,null,null,null,null,null,null,null,null,null,null,null,null,null,null,null,null,null,null,null,null,null,null,null,null,null,null,null,null,null,null,null,null,0,{"$f":"IF(PARCIAL1!L$8=0,0,(ROUND(((BF52*10)/PARCIAL1!L$8),1)))","v":0},null,null,0,0,0,0,0,0,0,0,0,0,0,0,0,0,0,0,0,0,0,0,0,0,0,0,0,0,0,0,0,0,0,0,0,0,0,0,0,0,0,0,0,0,0,0,0,0,0,0,0,0,0,0,{"$f":"IF(#REF!>$Y$3,0,#REF!)","v":{"$error":"#REF!"}},{"$f":"IF(#REF!>$Y$3,0,#REF!)","v":{"$error":"#REF!"}},{"$f":"IF(#REF!>$Y$3,0,#REF!)","v":{"$error":"#REF!"}},{"$f":"IF(#REF!>$Y$3,0,#REF!)","v":{"$error":"#REF!"}},{"$f":"IF(#REF!>$Y$3,0,#REF!)","v":{"$error":"#REF!"}},{"$f":"IF(#REF!>$Y$3,0,#REF!)","v":{"$error":"#REF!"}},{"$f":"IF(#REF!>$Y$3,0,#REF!)","v":{"$error":"#REF!"}},{"$f":"IF(#REF!>$Y$3,0,#REF!)","v":{"$error":"#REF!"}},{"$f":"IF(#REF!>$Y$3,0,#REF!)","v":{"$error":"#REF!"}},{"$f":"IF(#REF!>$Y$3,0,#REF!)","v":{"$error":"#REF!"}},{"$f":"IF(#REF!>$Y$3,0,#REF!)","v":{"$error":"#REF!"}},{"$f":"IF(#REF!>$Y$3,0,#REF!)","v":{"$error":"#REF!"}},{"$f":"IF(#REF!>$Y$3,0,#REF!)","v":{"$error":"#REF!"}},{"$f":"IF(#REF!>$Y$3,0,#REF!)","v":{"$error":"#REF!"}},{"$f":"IF(#REF!>$Y$3,0,#REF!)","v":{"$error":"#REF!"}},{"$f":"IF(#REF!>$Y$3,0,#REF!)","v":{"$error":"#REF!"}},{"$f":"IF(#REF!>$Y$3,0,#REF!)","v":{"$error":"#REF!"}},{"$f":"IF(#REF!>$Y$3,0,#REF!)","v":{"$error":"#REF!"}},{"$f":"IF(#REF!>$Y$3,0,#REF!)","v":{"$error":"#REF!"}},{"$f":"IF(#REF!>$Y$3,0,#REF!)","v":{"$error":"#REF!"}},{"$f":"IF(#REF!>$Y$3,0,#REF!)","v":{"$error":"#REF!"}},{"$f":"IF(#REF!>$Y$3,0,#REF!)","v":{"$error":"#REF!"}},{"$f":"IF(#REF!>$Y$3,0,#REF!)","v":{"$error":"#REF!"}},{"$f":"IF(#REF!>$Y$3,0,#REF!)","v":{"$error":"#REF!"}},{"$f":"IF(#REF!>$Y$3,0,#REF!)","v":{"$error":"#REF!"}},{"$f":"IF(#REF!>$Y$3,0,#REF!)","v":{"$error":"#REF!"}},{"$f":"IF(#REF!>$Y$3,0,#REF!)","v":{"$error":"#REF!"}},{"$f":"IF(#REF!>$Y$3,0,#REF!)","v":{"$error":"#REF!"}}]
[null,null,49,null,null,null,null,null,null,null,null,null,null,null,null,null,null,null,null,null,null,null,null,null,null,null,null,null,null,null,null,null,null,null,null,null,null,null,null,null,null,null,null,null,null,null,null,null,null,null,null,null,null,null,null,null,null,0,{"$f":"IF(PARCIAL1!L$8=0,0,(ROUND(((BF53*10)/PARCIAL1!L$8),1)))","v":0},null,null,0,0,0,0,0,0,0,0,0,0,0,0,0,0,0,0,0,0,0,0,0,0,0,0,0,0,0,0,0,0,0,0,0,0,0,0,0,0,0,0,0,0,0,0,0,0,0,0,0,0,0,0,{"$f":"IF(#REF!>$Y$3,0,#REF!)","v":{"$error":"#REF!"}},{"$f":"IF(#REF!>$Y$3,0,#REF!)","v":{"$error":"#REF!"}},{"$f":"IF(#REF!>$Y$3,0,#REF!)","v":{"$error":"#REF!"}},{"$f":"IF(#REF!>$Y$3,0,#REF!)","v":{"$error":"#REF!"}},{"$f":"IF(#REF!>$Y$3,0,#REF!)","v":{"$error":"#REF!"}},{"$f":"IF(#REF!>$Y$3,0,#REF!)","v":{"$error":"#REF!"}},{"$f":"IF(#REF!>$Y$3,0,#REF!)","v":{"$error":"#REF!"}},{"$f":"IF(#REF!>$Y$3,0,#REF!)","v":{"$error":"#REF!"}},{"$f":"IF(#REF!>$Y$3,0,#REF!)","v":{"$error":"#REF!"}},{"$f":"IF(#REF!>$Y$3,0,#REF!)","v":{"$error":"#REF!"}},{"$f":"IF(#REF!>$Y$3,0,#REF!)","v":{"$error":"#REF!"}},{"$f":"IF(#REF!>$Y$3,0,#REF!)","v":{"$error":"#REF!"}},{"$f":"IF(#REF!>$Y$3,0,#REF!)","v":{"$error":"#REF!"}},{"$f":"IF(#REF!>$Y$3,0,#REF!)","v":{"$error":"#REF!"}},{"$f":"IF(#REF!>$Y$3,0,#REF!)","v":{"$error":"#REF!"}},{"$f":"IF(#REF!>$Y$3,0,#REF!)","v":{"$error":"#REF!"}},{"$f":"IF(#REF!>$Y$3,0,#REF!)","v":{"$error":"#REF!"}},{"$f":"IF(#REF!>$Y$3,0,#REF!)","v":{"$error":"#REF!"}},{"$f":"IF(#REF!>$Y$3,0,#REF!)","v":{"$error":"#REF!"}},{"$f":"IF(#REF!>$Y$3,0,#REF!)","v":{"$error":"#REF!"}},{"$f":"IF(#REF!>$Y$3,0,#REF!)","v":{"$error":"#REF!"}},{"$f":"IF(#REF!>$Y$3,0,#REF!)","v":{"$error":"#REF!"}},{"$f":"IF(#REF!>$Y$3,0,#REF!)","v":{"$error":"#REF!"}},{"$f":"IF(#REF!>$Y$3,0,#REF!)","v":{"$error":"#REF!"}},{"$f":"IF(#REF!>$Y$3,0,#REF!)","v":{"$error":"#REF!"}},{"$f":"IF(#REF!>$Y$3,0,#REF!)","v":{"$error":"#REF!"}},{"$f":"IF(#REF!>$Y$3,0,#REF!)","v":{"$error":"#REF!"}},{"$f":"IF(#REF!>$Y$3,0,#REF!)","v":{"$error":"#REF!"}}]
[null,null,50,null,null,null,null,null,null,null,null,null,null,null,null,null,null,null,null,null,null,null,null,null,null,null,null,null,null,null,null,null,null,null,null,null,null,null,null,null,null,null,null,null,null,null,null,null,null,null,null,null,null,null,null,null,null,0,{"$f":"IF(PARCIAL1!L$8=0,0,(ROUND(((BF54*10)/PARCIAL1!L$8),1)))","v":0},null,null,0,0,0,0,0,0,0,0,0,0,0,0,0,0,0,0,0,0,0,0,0,0,0,0,0,0,0,0,0,0,0,0,0,0,0,0,0,0,0,0,0,0,0,0,0,0,0,0,0,0,0,0,{"$f":"IF(#REF!>$Y$3,0,#REF!)","v":{"$error":"#REF!"}},{"$f":"IF(#REF!>$Y$3,0,#REF!)","v":{"$error":"#REF!"}},{"$f":"IF(#REF!>$Y$3,0,#REF!)","v":{"$error":"#REF!"}},{"$f":"IF(#REF!>$Y$3,0,#REF!)","v":{"$error":"#REF!"}},{"$f":"IF(#REF!>$Y$3,0,#REF!)","v":{"$error":"#REF!"}},{"$f":"IF(#REF!>$Y$3,0,#REF!)","v":{"$error":"#REF!"}},{"$f":"IF(#REF!>$Y$3,0,#REF!)","v":{"$error":"#REF!"}},{"$f":"IF(#REF!>$Y$3,0,#REF!)","v":{"$error":"#REF!"}},{"$f":"IF(#REF!>$Y$3,0,#REF!)","v":{"$error":"#REF!"}},{"$f":"IF(#REF!>$Y$3,0,#REF!)","v":{"$error":"#REF!"}},{"$f":"IF(#REF!>$Y$3,0,#REF!)","v":{"$error":"#REF!"}},{"$f":"IF(#REF!>$Y$3,0,#REF!)","v":{"$error":"#REF!"}},{"$f":"IF(#REF!>$Y$3,0,#REF!)","v":{"$error":"#REF!"}},{"$f":"IF(#REF!>$Y$3,0,#REF!)","v":{"$error":"#REF!"}},{"$f":"IF(#REF!>$Y$3,0,#REF!)","v":{"$error":"#REF!"}},{"$f":"IF(#REF!>$Y$3,0,#REF!)","v":{"$error":"#REF!"}},{"$f":"IF(#REF!>$Y$3,0,#REF!)","v":{"$error":"#REF!"}},{"$f":"IF(#REF!>$Y$3,0,#REF!)","v":{"$error":"#REF!"}},{"$f":"IF(#REF!>$Y$3,0,#REF!)","v":{"$error":"#REF!"}},{"$f":"IF(#REF!>$Y$3,0,#REF!)","v":{"$error":"#REF!"}},{"$f":"IF(#REF!>$Y$3,0,#REF!)","v":{"$error":"#REF!"}},{"$f":"IF(#REF!>$Y$3,0,#REF!)","v":{"$error":"#REF!"}},{"$f":"IF(#REF!>$Y$3,0,#REF!)","v":{"$error":"#REF!"}},{"$f":"IF(#REF!>$Y$3,0,#REF!)","v":{"$error":"#REF!"}},{"$f":"IF(#REF!>$Y$3,0,#REF!)","v":{"$error":"#REF!"}},{"$f":"IF(#REF!>$Y$3,0,#REF!)","v":{"$error":"#REF!"}},{"$f":"IF(#REF!>$Y$3,0,#REF!)","v":{"$error":"#REF!"}},{"$f":"IF(#REF!>$Y$3,0,#REF!)","v":{"$error":"#REF!"}}]
[null,null,51,null,null,null,null,null,null,null,null,null,null,null,null,null,null,null,null,null,null,null,null,null,null,null,null,null,null,null,null,null,null,null,null,null,null,null,null,null,null,null,null,null,null,null,null,null,null,null,null,null,null,null,null,null,null,0,{"$f":"IF(PARCIAL1!L$8=0,0,(ROUND(((BF55*10)/PARCIAL1!L$8),1)))","v":0},null,null,0,0,0,0,0,0,0,0,0,0,0,0,0,0,0,0,0,0,0,0,0,0,0,0,0,0,0,0,0,0,0,0,0,0,0,0,0,0,0,0,0,0,0,0,0,0,0,0,0,0,0,0,{"$f":"IF(#REF!>$Y$3,0,#REF!)","v":{"$error":"#REF!"}},{"$f":"IF(#REF!>$Y$3,0,#REF!)","v":{"$error":"#REF!"}},{"$f":"IF(#REF!>$Y$3,0,#REF!)","v":{"$error":"#REF!"}},{"$f":"IF(#REF!>$Y$3,0,#REF!)","v":{"$error":"#REF!"}},{"$f":"IF(#REF!>$Y$3,0,#REF!)","v":{"$error":"#REF!"}},{"$f":"IF(#REF!>$Y$3,0,#REF!)","v":{"$error":"#REF!"}},{"$f":"IF(#REF!>$Y$3,0,#REF!)","v":{"$error":"#REF!"}},{"$f":"IF(#REF!>$Y$3,0,#REF!)","v":{"$error":"#REF!"}},{"$f":"IF(#REF!>$Y$3,0,#REF!)","v":{"$error":"#REF!"}},{"$f":"IF(#REF!>$Y$3,0,#REF!)","v":{"$error":"#REF!"}},{"$f":"IF(#REF!>$Y$3,0,#REF!)","v":{"$error":"#REF!"}},{"$f":"IF(#REF!>$Y$3,0,#REF!)","v":{"$error":"#REF!"}},{"$f":"IF(#REF!>$Y$3,0,#REF!)","v":{"$error":"#REF!"}},{"$f":"IF(#REF!>$Y$3,0,#REF!)","v":{"$error":"#REF!"}},{"$f":"IF(#REF!>$Y$3,0,#REF!)","v":{"$error":"#REF!"}},{"$f":"IF(#REF!>$Y$3,0,#REF!)","v":{"$error":"#REF!"}},{"$f":"IF(#REF!>$Y$3,0,#REF!)","v":{"$error":"#REF!"}},{"$f":"IF(#REF!>$Y$3,0,#REF!)","v":{"$error":"#REF!"}},{"$f":"IF(#REF!>$Y$3,0,#REF!)","v":{"$error":"#REF!"}},{"$f":"IF(#REF!>$Y$3,0,#REF!)","v":{"$error":"#REF!"}},{"$f":"IF(#REF!>$Y$3,0,#REF!)","v":{"$error":"#REF!"}},{"$f":"IF(#REF!>$Y$3,0,#REF!)","v":{"$error":"#REF!"}},{"$f":"IF(#REF!>$Y$3,0,#REF!)","v":{"$error":"#REF!"}},{"$f":"IF(#REF!>$Y$3,0,#REF!)","v":{"$error":"#REF!"}},{"$f":"IF(#REF!>$Y$3,0,#REF!)","v":{"$error":"#REF!"}},{"$f":"IF(#REF!>$Y$3,0,#REF!)","v":{"$error":"#REF!"}},{"$f":"IF(#REF!>$Y$3,0,#REF!)","v":{"$error":"#REF!"}},{"$f":"IF(#REF!>$Y$3,0,#REF!)","v":{"$error":"#REF!"}}]
[null,null,52,null,null,null,null,null,null,null,null,null,null,null,null,null,null,null,null,null,null,null,null,null,null,null,null,null,null,null,null,null,null,null,null,null,null,null,null,null,null,null,null,null,null,null,null,null,null,null,null,null,null,null,null,null,null,0,{"$f":"IF(PARCIAL1!L$8=0,0,(ROUND(((BF56*10)/PARCIAL1!L$8),1)))","v":0},null,null,0,0,0,0,0,0,0,0,0,0,0,0,0,0,0,0,0,0,0,0,0,0,0,0,0,0,0,0,0,0,0,0,0,0,0,0,0,0,0,0,0,0,0,0,0,0,0,0,0,0,0,0,{"$f":"IF(#REF!>$Y$3,0,#REF!)","v":{"$error":"#REF!"}},{"$f":"IF(#REF!>$Y$3,0,#REF!)","v":{"$error":"#REF!"}},{"$f":"IF(#REF!>$Y$3,0,#REF!)","v":{"$error":"#REF!"}},{"$f":"IF(#REF!>$Y$3,0,#REF!)","v":{"$error":"#REF!"}},{"$f":"IF(#REF!>$Y$3,0,#REF!)","v":{"$error":"#REF!"}},{"$f":"IF(#REF!>$Y$3,0,#REF!)","v":{"$error":"#REF!"}},{"$f":"IF(#REF!>$Y$3,0,#REF!)","v":{"$error":"#REF!"}},{"$f":"IF(#REF!>$Y$3,0,#REF!)","v":{"$error":"#REF!"}},{"$f":"IF(#REF!>$Y$3,0,#REF!)","v":{"$error":"#REF!"}},{"$f":"IF(#REF!>$Y$3,0,#REF!)","v":{"$error":"#REF!"}},{"$f":"IF(#REF!>$Y$3,0,#REF!)","v":{"$error":"#REF!"}},{"$f":"IF(#REF!>$Y$3,0,#REF!)","v":{"$error":"#REF!"}},{"$f":"IF(#REF!>$Y$3,0,#REF!)","v":{"$error":"#REF!"}},{"$f":"IF(#REF!>$Y$3,0,#REF!)","v":{"$error":"#REF!"}},{"$f":"IF(#REF!>$Y$3,0,#REF!)","v":{"$error":"#REF!"}},{"$f":"IF(#REF!>$Y$3,0,#REF!)","v":{"$error":"#REF!"}},{"$f":"IF(#REF!>$Y$3,0,#REF!)","v":{"$error":"#REF!"}},{"$f":"IF(#REF!>$Y$3,0,#REF!)","v":{"$error":"#REF!"}},{"$f":"IF(#REF!>$Y$3,0,#REF!)","v":{"$error":"#REF!"}},{"$f":"IF(#REF!>$Y$3,0,#REF!)","v":{"$error":"#REF!"}},{"$f":"IF(#REF!>$Y$3,0,#REF!)","v":{"$error":"#REF!"}},{"$f":"IF(#REF!>$Y$3,0,#REF!)","v":{"$error":"#REF!"}},{"$f":"IF(#REF!>$Y$3,0,#REF!)","v":{"$error":"#REF!"}},{"$f":"IF(#REF!>$Y$3,0,#REF!)","v":{"$error":"#REF!"}},{"$f":"IF(#REF!>$Y$3,0,#REF!)","v":{"$error":"#REF!"}},{"$f":"IF(#REF!>$Y$3,0,#REF!)","v":{"$error":"#REF!"}},{"$f":"IF(#REF!>$Y$3,0,#REF!)","v":{"$error":"#REF!"}},{"$f":"IF(#REF!>$Y$3,0,#REF!)","v":{"$error":"#REF!"}}]
[null,null,53,null,null,null,null,null,null,null,null,null,null,null,null,null,null,null,null,null,null,null,null,null,null,null,null,null,null,null,null,null,null,null,null,null,null,null,null,null,null,null,null,null,null,null,null,null,null,null,null,null,null,null,null,null,null,0,{"$f":"IF(PARCIAL1!L$8=0,0,(ROUND(((BF57*10)/PARCIAL1!L$8),1)))","v":0},null,null,0,0,0,0,0,0,0,0,0,0,0,0,0,0,0,0,0,0,0,0,0,0,0,0,0,0,0,0,0,0,0,0,0,0,0,0,0,0,0,0,0,0,0,0,0,0,0,0,0,0,0,0,{"$f":"IF(#REF!>$Y$3,0,#REF!)","v":{"$error":"#REF!"}},{"$f":"IF(#REF!>$Y$3,0,#REF!)","v":{"$error":"#REF!"}},{"$f":"IF(#REF!>$Y$3,0,#REF!)","v":{"$error":"#REF!"}},{"$f":"IF(#REF!>$Y$3,0,#REF!)","v":{"$error":"#REF!"}},{"$f":"IF(#REF!>$Y$3,0,#REF!)","v":{"$error":"#REF!"}},{"$f":"IF(#REF!>$Y$3,0,#REF!)","v":{"$error":"#REF!"}},{"$f":"IF(#REF!>$Y$3,0,#REF!)","v":{"$error":"#REF!"}},{"$f":"IF(#REF!>$Y$3,0,#REF!)","v":{"$error":"#REF!"}},{"$f":"IF(#REF!>$Y$3,0,#REF!)","v":{"$error":"#REF!"}},{"$f":"IF(#REF!>$Y$3,0,#REF!)","v":{"$error":"#REF!"}},{"$f":"IF(#REF!>$Y$3,0,#REF!)","v":{"$error":"#REF!"}},{"$f":"IF(#REF!>$Y$3,0,#REF!)","v":{"$error":"#REF!"}},{"$f":"IF(#REF!>$Y$3,0,#REF!)","v":{"$error":"#REF!"}},{"$f":"IF(#REF!>$Y$3,0,#REF!)","v":{"$error":"#REF!"}},{"$f":"IF(#REF!>$Y$3,0,#REF!)","v":{"$error":"#REF!"}},{"$f":"IF(#REF!>$Y$3,0,#REF!)","v":{"$error":"#REF!"}},{"$f":"IF(#REF!>$Y$3,0,#REF!)","v":{"$error":"#REF!"}},{"$f":"IF(#REF!>$Y$3,0,#REF!)","v":{"$error":"#REF!"}},{"$f":"IF(#REF!>$Y$3,0,#REF!)","v":{"$error":"#REF!"}},{"$f":"IF(#REF!>$Y$3,0,#REF!)","v":{"$error":"#REF!"}},{"$f":"IF(#REF!>$Y$3,0,#REF!)","v":{"$error":"#REF!"}},{"$f":"IF(#REF!>$Y$3,0,#REF!)","v":{"$error":"#REF!"}},{"$f":"IF(#REF!>$Y$3,0,#REF!)","v":{"$error":"#REF!"}},{"$f":"IF(#REF!>$Y$3,0,#REF!)","v":{"$error":"#REF!"}},{"$f":"IF(#REF!>$Y$3,0,#REF!)","v":{"$error":"#REF!"}},{"$f":"IF(#REF!>$Y$3,0,#REF!)","v":{"$error":"#REF!"}},{"$f":"IF(#REF!>$Y$3,0,#REF!)","v":{"$error":"#REF!"}},{"$f":"IF(#REF!>$Y$3,0,#REF!)","v":{"$error":"#REF!"}}]
[null,null,54,null,null,null,null,null,null,null,null,null,null,null,null,null,null,null,null,null,null,null,null,null,null,null,null,null,null,null,null,null,null,null,null,null,null,null,null,null,null,null,null,null,null,null,null,null,null,null,null,null,null,null,null,null,null,0,{"$f":"IF(PARCIAL1!L$8=0,0,(ROUND(((BF58*10)/PARCIAL1!L$8),1)))","v":0},null,null,0,0,0,0,0,0,0,0,0,0,0,0,0,0,0,0,0,0,0,0,0,0,0,0,0,0,0,0,0,0,0,0,0,0,0,0,0,0,0,0,0,0,0,0,0,0,0,0,0,0,0,0,{"$f":"IF(#REF!>$Y$3,0,#REF!)","v":{"$error":"#REF!"}},{"$f":"IF(#REF!>$Y$3,0,#REF!)","v":{"$error":"#REF!"}},{"$f":"IF(#REF!>$Y$3,0,#REF!)","v":{"$error":"#REF!"}},{"$f":"IF(#REF!>$Y$3,0,#REF!)","v":{"$error":"#REF!"}},{"$f":"IF(#REF!>$Y$3,0,#REF!)","v":{"$error":"#REF!"}},{"$f":"IF(#REF!>$Y$3,0,#REF!)","v":{"$error":"#REF!"}},{"$f":"IF(#REF!>$Y$3,0,#REF!)","v":{"$error":"#REF!"}},{"$f":"IF(#REF!>$Y$3,0,#REF!)","v":{"$error":"#REF!"}},{"$f":"IF(#REF!>$Y$3,0,#REF!)","v":{"$error":"#REF!"}},{"$f":"IF(#REF!>$Y$3,0,#REF!)","v":{"$error":"#REF!"}},{"$f":"IF(#REF!>$Y$3,0,#REF!)","v":{"$error":"#REF!"}},{"$f":"IF(#REF!>$Y$3,0,#REF!)","v":{"$error":"#REF!"}},{"$f":"IF(#REF!>$Y$3,0,#REF!)","v":{"$error":"#REF!"}},{"$f":"IF(#REF!>$Y$3,0,#REF!)","v":{"$error":"#REF!"}},{"$f":"IF(#REF!>$Y$3,0,#REF!)","v":{"$error":"#REF!"}},{"$f":"IF(#REF!>$Y$3,0,#REF!)","v":{"$error":"#REF!"}},{"$f":"IF(#REF!>$Y$3,0,#REF!)","v":{"$error":"#REF!"}},{"$f":"IF(#REF!>$Y$3,0,#REF!)","v":{"$error":"#REF!"}},{"$f":"IF(#REF!>$Y$3,0,#REF!)","v":{"$error":"#REF!"}},{"$f":"IF(#REF!>$Y$3,0,#REF!)","v":{"$error":"#REF!"}},{"$f":"IF(#REF!>$Y$3,0,#REF!)","v":{"$error":"#REF!"}},{"$f":"IF(#REF!>$Y$3,0,#REF!)","v":{"$error":"#REF!"}},{"$f":"IF(#REF!>$Y$3,0,#REF!)","v":{"$error":"#REF!"}},{"$f":"IF(#REF!>$Y$3,0,#REF!)","v":{"$error":"#REF!"}},{"$f":"IF(#REF!>$Y$3,0,#REF!)","v":{"$error":"#REF!"}},{"$f":"IF(#REF!>$Y$3,0,#REF!)","v":{"$error":"#REF!"}},{"$f":"IF(#REF!>$Y$3,0,#REF!)","v":{"$error":"#REF!"}},{"$f":"IF(#REF!>$Y$3,0,#REF!)","v":{"$error":"#REF!"}}]
[null,null,55,null,null,null,null,null,null,null,null,null,null,null,null,null,null,null,null,null,null,null,null,null,null,null,null,null,null,null,null,null,null,null,null,null,null,null,null,null,null,null,null,null,null,null,null,null,null,null,null,null,null,null,null,null,null,0,{"$f":"IF(PARCIAL1!L$8=0,0,(ROUND(((BF59*10)/PARCIAL1!L$8),1)))","v":0},null,null,0,0,0,0,0,0,0,0,0,0,0,0,0,0,0,0,0,0,0,0,0,0,0,0,0,0,0,0,0,0,0,0,0,0,0,0,0,0,0,0,0,0,0,0,0,0,0,0,0,0,0,0,{"$f":"IF(#REF!>$Y$3,0,#REF!)","v":{"$error":"#REF!"}},{"$f":"IF(#REF!>$Y$3,0,#REF!)","v":{"$error":"#REF!"}},{"$f":"IF(#REF!>$Y$3,0,#REF!)","v":{"$error":"#REF!"}},{"$f":"IF(#REF!>$Y$3,0,#REF!)","v":{"$error":"#REF!"}},{"$f":"IF(#REF!>$Y$3,0,#REF!)","v":{"$error":"#REF!"}},{"$f":"IF(#REF!>$Y$3,0,#REF!)","v":{"$error":"#REF!"}},{"$f":"IF(#REF!>$Y$3,0,#REF!)","v":{"$error":"#REF!"}},{"$f":"IF(#REF!>$Y$3,0,#REF!)","v":{"$error":"#REF!"}},{"$f":"IF(#REF!>$Y$3,0,#REF!)","v":{"$error":"#REF!"}},{"$f":"IF(#REF!>$Y$3,0,#REF!)","v":{"$error":"#REF!"}},{"$f":"IF(#REF!>$Y$3,0,#REF!)","v":{"$error":"#REF!"}},{"$f":"IF(#REF!>$Y$3,0,#REF!)","v":{"$error":"#REF!"}},{"$f":"IF(#REF!>$Y$3,0,#REF!)","v":{"$error":"#REF!"}},{"$f":"IF(#REF!>$Y$3,0,#REF!)","v":{"$error":"#REF!"}},{"$f":"IF(#REF!>$Y$3,0,#REF!)","v":{"$error":"#REF!"}},{"$f":"IF(#REF!>$Y$3,0,#REF!)","v":{"$error":"#REF!"}},{"$f":"IF(#REF!>$Y$3,0,#REF!)","v":{"$error":"#REF!"}},{"$f":"IF(#REF!>$Y$3,0,#REF!)","v":{"$error":"#REF!"}},{"$f":"IF(#REF!>$Y$3,0,#REF!)","v":{"$error":"#REF!"}},{"$f":"IF(#REF!>$Y$3,0,#REF!)","v":{"$error":"#REF!"}},{"$f":"IF(#REF!>$Y$3,0,#REF!)","v":{"$error":"#REF!"}},{"$f":"IF(#REF!>$Y$3,0,#REF!)","v":{"$error":"#REF!"}},{"$f":"IF(#REF!>$Y$3,0,#REF!)","v":{"$error":"#REF!"}},{"$f":"IF(#REF!>$Y$3,0,#REF!)","v":{"$error":"#REF!"}},{"$f":"IF(#REF!>$Y$3,0,#REF!)","v":{"$error":"#REF!"}},{"$f":"IF(#REF!>$Y$3,0,#REF!)","v":{"$error":"#REF!"}},{"$f":"IF(#REF!>$Y$3,0,#REF!)","v":{"$error":"#REF!"}},{"$f":"IF(#REF!>$Y$3,0,#REF!)","v":{"$error":"#REF!"}}]
[null,null,56,null,null,null,null,null,null,null,null,null,null,null,null,null,null,null,null,null,null,null,null,null,null,null,null,null,null,null,null,null,null,null,null,null,null,null,null,null,null,null,null,null,null,null,null,null,null,null,null,null,null,null,null,null,null,0,{"$f":"IF(PARCIAL1!L$8=0,0,(ROUND(((BF60*10)/PARCIAL1!L$8),1)))","v":0},null,null,0,0,0,0,0,0,0,0,0,0,0,0,0,0,0,0,0,0,0,0,0,0,0,0,0,0,0,0,0,0,0,0,0,0,0,0,0,0,0,0,0,0,0,0,0,0,0,0,0,0,0,0,{"$f":"IF(#REF!>$Y$3,0,#REF!)","v":{"$error":"#REF!"}},{"$f":"IF(#REF!>$Y$3,0,#REF!)","v":{"$error":"#REF!"}},{"$f":"IF(#REF!>$Y$3,0,#REF!)","v":{"$error":"#REF!"}},{"$f":"IF(#REF!>$Y$3,0,#REF!)","v":{"$error":"#REF!"}},{"$f":"IF(#REF!>$Y$3,0,#REF!)","v":{"$error":"#REF!"}},{"$f":"IF(#REF!>$Y$3,0,#REF!)","v":{"$error":"#REF!"}},{"$f":"IF(#REF!>$Y$3,0,#REF!)","v":{"$error":"#REF!"}},{"$f":"IF(#REF!>$Y$3,0,#REF!)","v":{"$error":"#REF!"}},{"$f":"IF(#REF!>$Y$3,0,#REF!)","v":{"$error":"#REF!"}},{"$f":"IF(#REF!>$Y$3,0,#REF!)","v":{"$error":"#REF!"}},{"$f":"IF(#REF!>$Y$3,0,#REF!)","v":{"$error":"#REF!"}},{"$f":"IF(#REF!>$Y$3,0,#REF!)","v":{"$error":"#REF!"}},{"$f":"IF(#REF!>$Y$3,0,#REF!)","v":{"$error":"#REF!"}},{"$f":"IF(#REF!>$Y$3,0,#REF!)","v":{"$error":"#REF!"}},{"$f":"IF(#REF!>$Y$3,0,#REF!)","v":{"$error":"#REF!"}},{"$f":"IF(#REF!>$Y$3,0,#REF!)","v":{"$error":"#REF!"}},{"$f":"IF(#REF!>$Y$3,0,#REF!)","v":{"$error":"#REF!"}},{"$f":"IF(#REF!>$Y$3,0,#REF!)","v":{"$error":"#REF!"}},{"$f":"IF(#REF!>$Y$3,0,#REF!)","v":{"$error":"#REF!"}},{"$f":"IF(#REF!>$Y$3,0,#REF!)","v":{"$error":"#REF!"}},{"$f":"IF(#REF!>$Y$3,0,#REF!)","v":{"$error":"#REF!"}},{"$f":"IF(#REF!>$Y$3,0,#REF!)","v":{"$error":"#REF!"}},{"$f":"IF(#REF!>$Y$3,0,#REF!)","v":{"$error":"#REF!"}},{"$f":"IF(#REF!>$Y$3,0,#REF!)","v":{"$error":"#REF!"}},{"$f":"IF(#REF!>$Y$3,0,#REF!)","v":{"$error":"#REF!"}},{"$f":"IF(#REF!>$Y$3,0,#REF!)","v":{"$error":"#REF!"}},{"$f":"IF(#REF!>$Y$3,0,#REF!)","v":{"$error":"#REF!"}},{"$f":"IF(#REF!>$Y$3,0,#REF!)","v":{"$error":"#REF!"}}]
[null,null,57,null,null,null,null,null,null,null,null,null,null,null,null,null,null,null,null,null,null,null,null,null,null,null,null,null,null,null,null,null,null,null,null,null,null,null,null,null,null,null,null,null,null,null,null,null,null,null,null,null,null,null,null,null,null,0,{"$f":"IF(PARCIAL1!L$8=0,0,(ROUND(((BF61*10)/PARCIAL1!L$8),1)))","v":0},null,null,0,0,0,0,0,0,0,0,0,0,0,0,0,0,0,0,0,0,0,0,0,0,0,0,0,0,0,0,0,0,0,0,0,0,0,0,0,0,0,0,0,0,0,0,0,0,0,0,0,0,0,0,{"$f":"IF(#REF!>$Y$3,0,#REF!)","v":{"$error":"#REF!"}},{"$f":"IF(#REF!>$Y$3,0,#REF!)","v":{"$error":"#REF!"}},{"$f":"IF(#REF!>$Y$3,0,#REF!)","v":{"$error":"#REF!"}},{"$f":"IF(#REF!>$Y$3,0,#REF!)","v":{"$error":"#REF!"}},{"$f":"IF(#REF!>$Y$3,0,#REF!)","v":{"$error":"#REF!"}},{"$f":"IF(#REF!>$Y$3,0,#REF!)","v":{"$error":"#REF!"}},{"$f":"IF(#REF!>$Y$3,0,#REF!)","v":{"$error":"#REF!"}},{"$f":"IF(#REF!>$Y$3,0,#REF!)","v":{"$error":"#REF!"}},{"$f":"IF(#REF!>$Y$3,0,#REF!)","v":{"$error":"#REF!"}},{"$f":"IF(#REF!>$Y$3,0,#REF!)","v":{"$error":"#REF!"}},{"$f":"IF(#REF!>$Y$3,0,#REF!)","v":{"$error":"#REF!"}},{"$f":"IF(#REF!>$Y$3,0,#REF!)","v":{"$error":"#REF!"}},{"$f":"IF(#REF!>$Y$3,0,#REF!)","v":{"$error":"#REF!"}},{"$f":"IF(#REF!>$Y$3,0,#REF!)","v":{"$error":"#REF!"}},{"$f":"IF(#REF!>$Y$3,0,#REF!)","v":{"$error":"#REF!"}},{"$f":"IF(#REF!>$Y$3,0,#REF!)","v":{"$error":"#REF!"}},{"$f":"IF(#REF!>$Y$3,0,#REF!)","v":{"$error":"#REF!"}},{"$f":"IF(#REF!>$Y$3,0,#REF!)","v":{"$error":"#REF!"}},{"$f":"IF(#REF!>$Y$3,0,#REF!)","v":{"$error":"#REF!"}},{"$f":"IF(#REF!>$Y$3,0,#REF!)","v":{"$error":"#REF!"}},{"$f":"IF(#REF!>$Y$3,0,#REF!)","v":{"$error":"#REF!"}},{"$f":"IF(#REF!>$Y$3,0,#REF!)","v":{"$error":"#REF!"}},{"$f":"IF(#REF!>$Y$3,0,#REF!)","v":{"$error":"#REF!"}},{"$f":"IF(#REF!>$Y$3,0,#REF!)","v":{"$error":"#REF!"}},{"$f":"IF(#REF!>$Y$3,0,#REF!)","v":{"$error":"#REF!"}},{"$f":"IF(#REF!>$Y$3,0,#REF!)","v":{"$error":"#REF!"}},{"$f":"IF(#REF!>$Y$3,0,#REF!)","v":{"$error":"#REF!"}},{"$f":"IF(#REF!>$Y$3,0,#REF!)","v":{"$error":"#REF!"}}]
[null,null,58,null,null,null,null,null,null,null,null,null,null,null,null,null,null,null,null,null,null,null,null,null,null,null,null,null,null,null,null,null,null,null,null,null,null,null,null,null,null,null,null,null,null,null,null,null,null,null,null,null,null,null,null,null,null,0,{"$f":"IF(PARCIAL1!L$8=0,0,(ROUND(((BF62*10)/PARCIAL1!L$8),1)))","v":0},null,null,0,0,0,0,0,0,0,0,0,0,0,0,0,0,0,0,0,0,0,0,0,0,0,0,0,0,0,0,0,0,0,0,0,0,0,0,0,0,0,0,0,0,0,0,0,0,0,0,0,0,0,0,{"$f":"IF(#REF!>$Y$3,0,#REF!)","v":{"$error":"#REF!"}},{"$f":"IF(#REF!>$Y$3,0,#REF!)","v":{"$error":"#REF!"}},{"$f":"IF(#REF!>$Y$3,0,#REF!)","v":{"$error":"#REF!"}},{"$f":"IF(#REF!>$Y$3,0,#REF!)","v":{"$error":"#REF!"}},{"$f":"IF(#REF!>$Y$3,0,#REF!)","v":{"$error":"#REF!"}},{"$f":"IF(#REF!>$Y$3,0,#REF!)","v":{"$error":"#REF!"}},{"$f":"IF(#REF!>$Y$3,0,#REF!)","v":{"$error":"#REF!"}},{"$f":"IF(#REF!>$Y$3,0,#REF!)","v":{"$error":"#REF!"}},{"$f":"IF(#REF!>$Y$3,0,#REF!)","v":{"$error":"#REF!"}},{"$f":"IF(#REF!>$Y$3,0,#REF!)","v":{"$error":"#REF!"}},{"$f":"IF(#REF!>$Y$3,0,#REF!)","v":{"$error":"#REF!"}},{"$f":"IF(#REF!>$Y$3,0,#REF!)","v":{"$error":"#REF!"}},{"$f":"IF(#REF!>$Y$3,0,#REF!)","v":{"$error":"#REF!"}},{"$f":"IF(#REF!>$Y$3,0,#REF!)","v":{"$error":"#REF!"}},{"$f":"IF(#REF!>$Y$3,0,#REF!)","v":{"$error":"#REF!"}},{"$f":"IF(#REF!>$Y$3,0,#REF!)","v":{"$error":"#REF!"}},{"$f":"IF(#REF!>$Y$3,0,#REF!)","v":{"$error":"#REF!"}},{"$f":"IF(#REF!>$Y$3,0,#REF!)","v":{"$error":"#REF!"}},{"$f":"IF(#REF!>$Y$3,0,#REF!)","v":{"$error":"#REF!"}},{"$f":"IF(#REF!>$Y$3,0,#REF!)","v":{"$error":"#REF!"}},{"$f":"IF(#REF!>$Y$3,0,#REF!)","v":{"$error":"#REF!"}},{"$f":"IF(#REF!>$Y$3,0,#REF!)","v":{"$error":"#REF!"}},{"$f":"IF(#REF!>$Y$3,0,#REF!)","v":{"$error":"#REF!"}},{"$f":"IF(#REF!>$Y$3,0,#REF!)","v":{"$error":"#REF!"}},{"$f":"IF(#REF!>$Y$3,0,#REF!)","v":{"$error":"#REF!"}},{"$f":"IF(#REF!>$Y$3,0,#REF!)","v":{"$error":"#REF!"}},{"$f":"IF(#REF!>$Y$3,0,#REF!)","v":{"$error":"#REF!"}},{"$f":"IF(#REF!>$Y$3,0,#REF!)","v":{"$error":"#REF!"}}]
[null,null,59,null,null,null,null,null,null,null,null,null,null,null,null,null,null,null,null,null,null,null,null,null,null,null,null,null,null,null,null,null,null,null,null,null,null,null,null,null,null,null,null,null,null,null,null,null,null,null,null,null,null,null,null,null,null,0,{"$f":"IF(PARCIAL1!L$8=0,0,(ROUND(((BF63*10)/PARCIAL1!L$8),1)))","v":0},null,null,0,0,0,0,0,0,0,0,0,0,0,0,0,0,0,0,0,0,0,0,0,0,0,0,0,0,0,0,0,0,0,0,0,0,0,0,0,0,0,0,0,0,0,0,0,0,0,0,0,0,0,0,{"$f":"IF(#REF!>$Y$3,0,#REF!)","v":{"$error":"#REF!"}},{"$f":"IF(#REF!>$Y$3,0,#REF!)","v":{"$error":"#REF!"}},{"$f":"IF(#REF!>$Y$3,0,#REF!)","v":{"$error":"#REF!"}},{"$f":"IF(#REF!>$Y$3,0,#REF!)","v":{"$error":"#REF!"}},{"$f":"IF(#REF!>$Y$3,0,#REF!)","v":{"$error":"#REF!"}},{"$f":"IF(#REF!>$Y$3,0,#REF!)","v":{"$error":"#REF!"}},{"$f":"IF(#REF!>$Y$3,0,#REF!)","v":{"$error":"#REF!"}},{"$f":"IF(#REF!>$Y$3,0,#REF!)","v":{"$error":"#REF!"}},{"$f":"IF(#REF!>$Y$3,0,#REF!)","v":{"$error":"#REF!"}},{"$f":"IF(#REF!>$Y$3,0,#REF!)","v":{"$error":"#REF!"}},{"$f":"IF(#REF!>$Y$3,0,#REF!)","v":{"$error":"#REF!"}},{"$f":"IF(#REF!>$Y$3,0,#REF!)","v":{"$error":"#REF!"}},{"$f":"IF(#REF!>$Y$3,0,#REF!)","v":{"$error":"#REF!"}},{"$f":"IF(#REF!>$Y$3,0,#REF!)","v":{"$error":"#REF!"}},{"$f":"IF(#REF!>$Y$3,0,#REF!)","v":{"$error":"#REF!"}},{"$f":"IF(#REF!>$Y$3,0,#REF!)","v":{"$error":"#REF!"}},{"$f":"IF(#REF!>$Y$3,0,#REF!)","v":{"$error":"#REF!"}},{"$f":"IF(#REF!>$Y$3,0,#REF!)","v":{"$error":"#REF!"}},{"$f":"IF(#REF!>$Y$3,0,#REF!)","v":{"$error":"#REF!"}},{"$f":"IF(#REF!>$Y$3,0,#REF!)","v":{"$error":"#REF!"}},{"$f":"IF(#REF!>$Y$3,0,#REF!)","v":{"$error":"#REF!"}},{"$f":"IF(#REF!>$Y$3,0,#REF!)","v":{"$error":"#REF!"}},{"$f":"IF(#REF!>$Y$3,0,#REF!)","v":{"$error":"#REF!"}},{"$f":"IF(#REF!>$Y$3,0,#REF!)","v":{"$error":"#REF!"}},{"$f":"IF(#REF!>$Y$3,0,#REF!)","v":{"$error":"#REF!"}},{"$f":"IF(#REF!>$Y$3,0,#REF!)","v":{"$error":"#REF!"}},{"$f":"IF(#REF!>$Y$3,0,#REF!)","v":{"$error":"#REF!"}},{"$f":"IF(#REF!>$Y$3,0,#REF!)","v":{"$error":"#REF!"}}]
[null,null,60,null,null,null,null,null,null,null,null,null,null,null,null,null,null,null,null,null,null,null,null,null,null,null,null,null,null,null,null,null,null,null,null,null,null,null,null,null,null,null,null,null,null,null,null,null,null,null,null,null,null,null,null,null,null,0,{"$f":"IF(PARCIAL1!L$8=0,0,(ROUND(((BF64*10)/PARCIAL1!L$8),1)))","v":0},null,null,0,0,0,0,0,0,0,0,0,0,0,0,0,0,0,0,0,0,0,0,0,0,0,0,0,0,0,0,0,0,0,0,0,0,0,0,0,0,0,0,0,0,0,0,0,0,0,0,0,0,0,0,{"$f":"IF(#REF!>$Y$3,0,#REF!)","v":{"$error":"#REF!"}},{"$f":"IF(#REF!>$Y$3,0,#REF!)","v":{"$error":"#REF!"}},{"$f":"IF(#REF!>$Y$3,0,#REF!)","v":{"$error":"#REF!"}},{"$f":"IF(#REF!>$Y$3,0,#REF!)","v":{"$error":"#REF!"}},{"$f":"IF(#REF!>$Y$3,0,#REF!)","v":{"$error":"#REF!"}},{"$f":"IF(#REF!>$Y$3,0,#REF!)","v":{"$error":"#REF!"}},{"$f":"IF(#REF!>$Y$3,0,#REF!)","v":{"$error":"#REF!"}},{"$f":"IF(#REF!>$Y$3,0,#REF!)","v":{"$error":"#REF!"}},{"$f":"IF(#REF!>$Y$3,0,#REF!)","v":{"$error":"#REF!"}},{"$f":"IF(#REF!>$Y$3,0,#REF!)","v":{"$error":"#REF!"}},{"$f":"IF(#REF!>$Y$3,0,#REF!)","v":{"$error":"#REF!"}},{"$f":"IF(#REF!>$Y$3,0,#REF!)","v":{"$error":"#REF!"}},{"$f":"IF(#REF!>$Y$3,0,#REF!)","v":{"$error":"#REF!"}},{"$f":"IF(#REF!>$Y$3,0,#REF!)","v":{"$error":"#REF!"}},{"$f":"IF(#REF!>$Y$3,0,#REF!)","v":{"$error":"#REF!"}},{"$f":"IF(#REF!>$Y$3,0,#REF!)","v":{"$error":"#REF!"}},{"$f":"IF(#REF!>$Y$3,0,#REF!)","v":{"$error":"#REF!"}},{"$f":"IF(#REF!>$Y$3,0,#REF!)","v":{"$error":"#REF!"}},{"$f":"IF(#REF!>$Y$3,0,#REF!)","v":{"$error":"#REF!"}},{"$f":"IF(#REF!>$Y$3,0,#REF!)","v":{"$error":"#REF!"}},{"$f":"IF(#REF!>$Y$3,0,#REF!)","v":{"$error":"#REF!"}},{"$f":"IF(#REF!>$Y$3,0,#REF!)","v":{"$error":"#REF!"}},{"$f":"IF(#REF!>$Y$3,0,#REF!)","v":{"$error":"#REF!"}},{"$f":"IF(#REF!>$Y$3,0,#REF!)","v":{"$error":"#REF!"}},{"$f":"IF(#REF!>$Y$3,0,#REF!)","v":{"$error":"#REF!"}},{"$f":"IF(#REF!>$Y$3,0,#REF!)","v":{"$error":"#REF!"}},{"$f":"IF(#REF!>$Y$3,0,#REF!)","v":{"$error":"#REF!"}},{"$f":"IF(#REF!>$Y$3,0,#REF!)","v":{"$error":"#REF!"}}]
[null,null,61,null,null,null,null,null,null,null,null,null,null,null,null,null,null,null,null,null,null,null,null,null,null,null,null,null,null,null,null,null,null,null,null,null,null,null,null,null,null,null,null,null,null,null,null,null,null,null,null,null,null,null,null,null,null,0,{"$f":"IF(PARCIAL1!L$8=0,0,(ROUND(((BF65*10)/PARCIAL1!L$8),1)))","v":0},null,null,0,0,0,0,0,0,0,0,0,0,0,0,0,0,0,0,0,0,0,0,0,0,0,0,0,0,0,0,0,0,0,0,0,0,0,0,0,0,0,0,0,0,0,0,0,0,0,0,0,0,0,0,{"$f":"IF(#REF!>$Y$3,0,#REF!)","v":{"$error":"#REF!"}},{"$f":"IF(#REF!>$Y$3,0,#REF!)","v":{"$error":"#REF!"}},{"$f":"IF(#REF!>$Y$3,0,#REF!)","v":{"$error":"#REF!"}},{"$f":"IF(#REF!>$Y$3,0,#REF!)","v":{"$error":"#REF!"}},{"$f":"IF(#REF!>$Y$3,0,#REF!)","v":{"$error":"#REF!"}},{"$f":"IF(#REF!>$Y$3,0,#REF!)","v":{"$error":"#REF!"}},{"$f":"IF(#REF!>$Y$3,0,#REF!)","v":{"$error":"#REF!"}},{"$f":"IF(#REF!>$Y$3,0,#REF!)","v":{"$error":"#REF!"}},{"$f":"IF(#REF!>$Y$3,0,#REF!)","v":{"$error":"#REF!"}},{"$f":"IF(#REF!>$Y$3,0,#REF!)","v":{"$error":"#REF!"}},{"$f":"IF(#REF!>$Y$3,0,#REF!)","v":{"$error":"#REF!"}},{"$f":"IF(#REF!>$Y$3,0,#REF!)","v":{"$error":"#REF!"}},{"$f":"IF(#REF!>$Y$3,0,#REF!)","v":{"$error":"#REF!"}},{"$f":"IF(#REF!>$Y$3,0,#REF!)","v":{"$error":"#REF!"}},{"$f":"IF(#REF!>$Y$3,0,#REF!)","v":{"$error":"#REF!"}},{"$f":"IF(#REF!>$Y$3,0,#REF!)","v":{"$error":"#REF!"}},{"$f":"IF(#REF!>$Y$3,0,#REF!)","v":{"$error":"#REF!"}},{"$f":"IF(#REF!>$Y$3,0,#REF!)","v":{"$error":"#REF!"}},{"$f":"IF(#REF!>$Y$3,0,#REF!)","v":{"$error":"#REF!"}},{"$f":"IF(#REF!>$Y$3,0,#REF!)","v":{"$error":"#REF!"}},{"$f":"IF(#REF!>$Y$3,0,#REF!)","v":{"$error":"#REF!"}},{"$f":"IF(#REF!>$Y$3,0,#REF!)","v":{"$error":"#REF!"}},{"$f":"IF(#REF!>$Y$3,0,#REF!)","v":{"$error":"#REF!"}},{"$f":"IF(#REF!>$Y$3,0,#REF!)","v":{"$error":"#REF!"}},{"$f":"IF(#REF!>$Y$3,0,#REF!)","v":{"$error":"#REF!"}},{"$f":"IF(#REF!>$Y$3,0,#REF!)","v":{"$error":"#REF!"}},{"$f":"IF(#REF!>$Y$3,0,#REF!)","v":{"$error":"#REF!"}},{"$f":"IF(#REF!>$Y$3,0,#REF!)","v":{"$error":"#REF!"}}]
[null,null,62,null,null,null,null,null,null,null,null,null,null,null,null,null,null,null,null,null,null,null,null,null,null,null,null,null,null,null,null,null,null,null,null,null,null,null,null,null,null,null,null,null,null,null,null,null,null,null,null,null,null,null,null,null,null,0,{"$f":"IF(PARCIAL1!L$8=0,0,(ROUND(((BF66*10)/PARCIAL1!L$8),1)))","v":0},null,null,0,0,0,0,0,0,0,0,0,0,0,0,0,0,0,0,0,0,0,0,0,0,0,0,0,0,0,0,0,0,0,0,0,0,0,0,0,0,0,0,0,0,0,0,0,0,0,0,0,0,0,0,{"$f":"IF(#REF!>$Y$3,0,#REF!)","v":{"$error":"#REF!"}},{"$f":"IF(#REF!>$Y$3,0,#REF!)","v":{"$error":"#REF!"}},{"$f":"IF(#REF!>$Y$3,0,#REF!)","v":{"$error":"#REF!"}},{"$f":"IF(#REF!>$Y$3,0,#REF!)","v":{"$error":"#REF!"}},{"$f":"IF(#REF!>$Y$3,0,#REF!)","v":{"$error":"#REF!"}},{"$f":"IF(#REF!>$Y$3,0,#REF!)","v":{"$error":"#REF!"}},{"$f":"IF(#REF!>$Y$3,0,#REF!)","v":{"$error":"#REF!"}},{"$f":"IF(#REF!>$Y$3,0,#REF!)","v":{"$error":"#REF!"}},{"$f":"IF(#REF!>$Y$3,0,#REF!)","v":{"$error":"#REF!"}},{"$f":"IF(#REF!>$Y$3,0,#REF!)","v":{"$error":"#REF!"}},{"$f":"IF(#REF!>$Y$3,0,#REF!)","v":{"$error":"#REF!"}},{"$f":"IF(#REF!>$Y$3,0,#REF!)","v":{"$error":"#REF!"}},{"$f":"IF(#REF!>$Y$3,0,#REF!)","v":{"$error":"#REF!"}},{"$f":"IF(#REF!>$Y$3,0,#REF!)","v":{"$error":"#REF!"}},{"$f":"IF(#REF!>$Y$3,0,#REF!)","v":{"$error":"#REF!"}},{"$f":"IF(#REF!>$Y$3,0,#REF!)","v":{"$error":"#REF!"}},{"$f":"IF(#REF!>$Y$3,0,#REF!)","v":{"$error":"#REF!"}},{"$f":"IF(#REF!>$Y$3,0,#REF!)","v":{"$error":"#REF!"}},{"$f":"IF(#REF!>$Y$3,0,#REF!)","v":{"$error":"#REF!"}},{"$f":"IF(#REF!>$Y$3,0,#REF!)","v":{"$error":"#REF!"}},{"$f":"IF(#REF!>$Y$3,0,#REF!)","v":{"$error":"#REF!"}},{"$f":"IF(#REF!>$Y$3,0,#REF!)","v":{"$error":"#REF!"}},{"$f":"IF(#REF!>$Y$3,0,#REF!)","v":{"$error":"#REF!"}},{"$f":"IF(#REF!>$Y$3,0,#REF!)","v":{"$error":"#REF!"}},{"$f":"IF(#REF!>$Y$3,0,#REF!)","v":{"$error":"#REF!"}},{"$f":"IF(#REF!>$Y$3,0,#REF!)","v":{"$error":"#REF!"}},{"$f":"IF(#REF!>$Y$3,0,#REF!)","v":{"$error":"#REF!"}},{"$f":"IF(#REF!>$Y$3,0,#REF!)","v":{"$error":"#REF!"}}]
[null,null,63,null,null,null,null,null,null,null,null,null,null,null,null,null,null,null,null,null,null,null,null,null,null,null,null,null,null,null,null,null,null,null,null,null,null,null,null,null,null,null,null,null,null,null,null,null,null,null,null,null,null,null,null,null,null,0,{"$f":"IF(PARCIAL1!L$8=0,0,(ROUND(((BF67*10)/PARCIAL1!L$8),1)))","v":0},null,null,0,0,0,0,0,0,0,0,0,0,0,0,0,0,0,0,0,0,0,0,0,0,0,0,0,0,0,0,0,0,0,0,0,0,0,0,0,0,0,0,0,0,0,0,0,0,0,0,0,0,0,0,{"$f":"IF(#REF!>$Y$3,0,#REF!)","v":{"$error":"#REF!"}},{"$f":"IF(#REF!>$Y$3,0,#REF!)","v":{"$error":"#REF!"}},{"$f":"IF(#REF!>$Y$3,0,#REF!)","v":{"$error":"#REF!"}},{"$f":"IF(#REF!>$Y$3,0,#REF!)","v":{"$error":"#REF!"}},{"$f":"IF(#REF!>$Y$3,0,#REF!)","v":{"$error":"#REF!"}},{"$f":"IF(#REF!>$Y$3,0,#REF!)","v":{"$error":"#REF!"}},{"$f":"IF(#REF!>$Y$3,0,#REF!)","v":{"$error":"#REF!"}},{"$f":"IF(#REF!>$Y$3,0,#REF!)","v":{"$error":"#REF!"}},{"$f":"IF(#REF!>$Y$3,0,#REF!)","v":{"$error":"#REF!"}},{"$f":"IF(#REF!>$Y$3,0,#REF!)","v":{"$error":"#REF!"}},{"$f":"IF(#REF!>$Y$3,0,#REF!)","v":{"$error":"#REF!"}},{"$f":"IF(#REF!>$Y$3,0,#REF!)","v":{"$error":"#REF!"}},{"$f":"IF(#REF!>$Y$3,0,#REF!)","v":{"$error":"#REF!"}},{"$f":"IF(#REF!>$Y$3,0,#REF!)","v":{"$error":"#REF!"}},{"$f":"IF(#REF!>$Y$3,0,#REF!)","v":{"$error":"#REF!"}},{"$f":"IF(#REF!>$Y$3,0,#REF!)","v":{"$error":"#REF!"}},{"$f":"IF(#REF!>$Y$3,0,#REF!)","v":{"$error":"#REF!"}},{"$f":"IF(#REF!>$Y$3,0,#REF!)","v":{"$error":"#REF!"}},{"$f":"IF(#REF!>$Y$3,0,#REF!)","v":{"$error":"#REF!"}},{"$f":"IF(#REF!>$Y$3,0,#REF!)","v":{"$error":"#REF!"}},{"$f":"IF(#REF!>$Y$3,0,#REF!)","v":{"$error":"#REF!"}},{"$f":"IF(#REF!>$Y$3,0,#REF!)","v":{"$error":"#REF!"}},{"$f":"IF(#REF!>$Y$3,0,#REF!)","v":{"$error":"#REF!"}},{"$f":"IF(#REF!>$Y$3,0,#REF!)","v":{"$error":"#REF!"}},{"$f":"IF(#REF!>$Y$3,0,#REF!)","v":{"$error":"#REF!"}},{"$f":"IF(#REF!>$Y$3,0,#REF!)","v":{"$error":"#REF!"}},{"$f":"IF(#REF!>$Y$3,0,#REF!)","v":{"$error":"#REF!"}},{"$f":"IF(#REF!>$Y$3,0,#REF!)","v":{"$error":"#REF!"}}]
[null,null,64,null,null,null,null,null,null,null,null,null,null,null,null,null,null,null,null,null,null,null,null,null,null,null,null,null,null,null,null,null,null,null,null,null,null,null,null,null,null,null,null,null,null,null,null,null,null,null,null,null,null,null,null,null,null,0,{"$f":"IF(PARCIAL1!L$8=0,0,(ROUND(((BF68*10)/PARCIAL1!L$8),1)))","v":0},null,null,0,0,0,0,0,0,0,0,0,0,0,0,0,0,0,0,0,0,0,0,0,0,0,0,0,0,0,0,0,0,0,0,0,0,0,0,0,0,0,0,0,0,0,0,0,0,0,0,0,0,0,0,{"$f":"IF(#REF!>$Y$3,0,#REF!)","v":{"$error":"#REF!"}},{"$f":"IF(#REF!>$Y$3,0,#REF!)","v":{"$error":"#REF!"}},{"$f":"IF(#REF!>$Y$3,0,#REF!)","v":{"$error":"#REF!"}},{"$f":"IF(#REF!>$Y$3,0,#REF!)","v":{"$error":"#REF!"}},{"$f":"IF(#REF!>$Y$3,0,#REF!)","v":{"$error":"#REF!"}},{"$f":"IF(#REF!>$Y$3,0,#REF!)","v":{"$error":"#REF!"}},{"$f":"IF(#REF!>$Y$3,0,#REF!)","v":{"$error":"#REF!"}},{"$f":"IF(#REF!>$Y$3,0,#REF!)","v":{"$error":"#REF!"}},{"$f":"IF(#REF!>$Y$3,0,#REF!)","v":{"$error":"#REF!"}},{"$f":"IF(#REF!>$Y$3,0,#REF!)","v":{"$error":"#REF!"}},{"$f":"IF(#REF!>$Y$3,0,#REF!)","v":{"$error":"#REF!"}},{"$f":"IF(#REF!>$Y$3,0,#REF!)","v":{"$error":"#REF!"}},{"$f":"IF(#REF!>$Y$3,0,#REF!)","v":{"$error":"#REF!"}},{"$f":"IF(#REF!>$Y$3,0,#REF!)","v":{"$error":"#REF!"}},{"$f":"IF(#REF!>$Y$3,0,#REF!)","v":{"$error":"#REF!"}},{"$f":"IF(#REF!>$Y$3,0,#REF!)","v":{"$error":"#REF!"}},{"$f":"IF(#REF!>$Y$3,0,#REF!)","v":{"$error":"#REF!"}},{"$f":"IF(#REF!>$Y$3,0,#REF!)","v":{"$error":"#REF!"}},{"$f":"IF(#REF!>$Y$3,0,#REF!)","v":{"$error":"#REF!"}},{"$f":"IF(#REF!>$Y$3,0,#REF!)","v":{"$error":"#REF!"}},{"$f":"IF(#REF!>$Y$3,0,#REF!)","v":{"$error":"#REF!"}},{"$f":"IF(#REF!>$Y$3,0,#REF!)","v":{"$error":"#REF!"}},{"$f":"IF(#REF!>$Y$3,0,#REF!)","v":{"$error":"#REF!"}},{"$f":"IF(#REF!>$Y$3,0,#REF!)","v":{"$error":"#REF!"}},{"$f":"IF(#REF!>$Y$3,0,#REF!)","v":{"$error":"#REF!"}},{"$f":"IF(#REF!>$Y$3,0,#REF!)","v":{"$error":"#REF!"}},{"$f":"IF(#REF!>$Y$3,0,#REF!)","v":{"$error":"#REF!"}},{"$f":"IF(#REF!>$Y$3,0,#REF!)","v":{"$error":"#REF!"}}]
[null,null,65,null,null,null,null,null,null,null,null,null,null,null,null,null,null,null,null,null,null,null,null,null,null,null,null,null,null,null,null,null,null,null,null,null,null,null,null,null,null,null,null,null,null,null,null,null,null,null,null,null,null,null,null,null,null,0,{"$f":"IF(PARCIAL1!L$8=0,0,(ROUND(((BF69*10)/PARCIAL1!L$8),1)))","v":0},null,null,0,0,0,0,0,0,0,0,0,0,0,0,0,0,0,0,0,0,0,0,0,0,0,0,0,0,0,0,0,0,0,0,0,0,0,0,0,0,0,0,0,0,0,0,0,0,0,0,0,0,0,0,{"$f":"IF(#REF!>$Y$3,0,#REF!)","v":{"$error":"#REF!"}},{"$f":"IF(#REF!>$Y$3,0,#REF!)","v":{"$error":"#REF!"}},{"$f":"IF(#REF!>$Y$3,0,#REF!)","v":{"$error":"#REF!"}},{"$f":"IF(#REF!>$Y$3,0,#REF!)","v":{"$error":"#REF!"}},{"$f":"IF(#REF!>$Y$3,0,#REF!)","v":{"$error":"#REF!"}},{"$f":"IF(#REF!>$Y$3,0,#REF!)","v":{"$error":"#REF!"}},{"$f":"IF(#REF!>$Y$3,0,#REF!)","v":{"$error":"#REF!"}},{"$f":"IF(#REF!>$Y$3,0,#REF!)","v":{"$error":"#REF!"}},{"$f":"IF(#REF!>$Y$3,0,#REF!)","v":{"$error":"#REF!"}},{"$f":"IF(#REF!>$Y$3,0,#REF!)","v":{"$error":"#REF!"}},{"$f":"IF(#REF!>$Y$3,0,#REF!)","v":{"$error":"#REF!"}},{"$f":"IF(#REF!>$Y$3,0,#REF!)","v":{"$error":"#REF!"}},{"$f":"IF(#REF!>$Y$3,0,#REF!)","v":{"$error":"#REF!"}},{"$f":"IF(#REF!>$Y$3,0,#REF!)","v":{"$error":"#REF!"}},{"$f":"IF(#REF!>$Y$3,0,#REF!)","v":{"$error":"#REF!"}},{"$f":"IF(#REF!>$Y$3,0,#REF!)","v":{"$error":"#REF!"}},{"$f":"IF(#REF!>$Y$3,0,#REF!)","v":{"$error":"#REF!"}},{"$f":"IF(#REF!>$Y$3,0,#REF!)","v":{"$error":"#REF!"}},{"$f":"IF(#REF!>$Y$3,0,#REF!)","v":{"$error":"#REF!"}},{"$f":"IF(#REF!>$Y$3,0,#REF!)","v":{"$error":"#REF!"}},{"$f":"IF(#REF!>$Y$3,0,#REF!)","v":{"$error":"#REF!"}},{"$f":"IF(#REF!>$Y$3,0,#REF!)","v":{"$error":"#REF!"}},{"$f":"IF(#REF!>$Y$3,0,#REF!)","v":{"$error":"#REF!"}},{"$f":"IF(#REF!>$Y$3,0,#REF!)","v":{"$error":"#REF!"}},{"$f":"IF(#REF!>$Y$3,0,#REF!)","v":{"$error":"#REF!"}},{"$f":"IF(#REF!>$Y$3,0,#REF!)","v":{"$error":"#REF!"}},{"$f":"IF(#REF!>$Y$3,0,#REF!)","v":{"$error":"#REF!"}},{"$f":"IF(#REF!>$Y$3,0,#REF!)","v":{"$error":"#REF!"}}]
[null,null,66,null,null,null,null,null,null,null,null,null,null,null,null,null,null,null,null,null,null,null,null,null,null,null,null,null,null,null,null,null,null,null,null,null,null,null,null,null,null,null,null,null,null,null,null,null,null,null,null,null,null,null,null,null,null,0,{"$f":"IF(PARCIAL1!L$8=0,0,(ROUND(((BF70*10)/PARCIAL1!L$8),1)))","v":0},null,null,0,0,0,0,0,0,0,0,0,0,0,0,0,0,0,0,0,0,0,0,0,0,0,0,0,0,0,0,0,0,0,0,0,0,0,0,0,0,0,0,0,0,0,0,0,0,0,0,0,0,0,0,{"$f":"IF(#REF!>$Y$3,0,#REF!)","v":{"$error":"#REF!"}},{"$f":"IF(#REF!>$Y$3,0,#REF!)","v":{"$error":"#REF!"}},{"$f":"IF(#REF!>$Y$3,0,#REF!)","v":{"$error":"#REF!"}},{"$f":"IF(#REF!>$Y$3,0,#REF!)","v":{"$error":"#REF!"}},{"$f":"IF(#REF!>$Y$3,0,#REF!)","v":{"$error":"#REF!"}},{"$f":"IF(#REF!>$Y$3,0,#REF!)","v":{"$error":"#REF!"}},{"$f":"IF(#REF!>$Y$3,0,#REF!)","v":{"$error":"#REF!"}},{"$f":"IF(#REF!>$Y$3,0,#REF!)","v":{"$error":"#REF!"}},{"$f":"IF(#REF!>$Y$3,0,#REF!)","v":{"$error":"#REF!"}},{"$f":"IF(#REF!>$Y$3,0,#REF!)","v":{"$error":"#REF!"}},{"$f":"IF(#REF!>$Y$3,0,#REF!)","v":{"$error":"#REF!"}},{"$f":"IF(#REF!>$Y$3,0,#REF!)","v":{"$error":"#REF!"}},{"$f":"IF(#REF!>$Y$3,0,#REF!)","v":{"$error":"#REF!"}},{"$f":"IF(#REF!>$Y$3,0,#REF!)","v":{"$error":"#REF!"}},{"$f":"IF(#REF!>$Y$3,0,#REF!)","v":{"$error":"#REF!"}},{"$f":"IF(#REF!>$Y$3,0,#REF!)","v":{"$error":"#REF!"}},{"$f":"IF(#REF!>$Y$3,0,#REF!)","v":{"$error":"#REF!"}},{"$f":"IF(#REF!>$Y$3,0,#REF!)","v":{"$error":"#REF!"}},{"$f":"IF(#REF!>$Y$3,0,#REF!)","v":{"$error":"#REF!"}},{"$f":"IF(#REF!>$Y$3,0,#REF!)","v":{"$error":"#REF!"}},{"$f":"IF(#REF!>$Y$3,0,#REF!)","v":{"$error":"#REF!"}},{"$f":"IF(#REF!>$Y$3,0,#REF!)","v":{"$error":"#REF!"}},{"$f":"IF(#REF!>$Y$3,0,#REF!)","v":{"$error":"#REF!"}},{"$f":"IF(#REF!>$Y$3,0,#REF!)","v":{"$error":"#REF!"}},{"$f":"IF(#REF!>$Y$3,0,#REF!)","v":{"$error":"#REF!"}},{"$f":"IF(#REF!>$Y$3,0,#REF!)","v":{"$error":"#REF!"}},{"$f":"IF(#REF!>$Y$3,0,#REF!)","v":{"$error":"#REF!"}},{"$f":"IF(#REF!>$Y$3,0,#REF!)","v":{"$error":"#REF!"}}]
[null,null,67,null,null,null,null,null,null,null,null,null,null,null,null,null,null,null,null,null,null,null,null,null,null,null,null,null,null,null,null,null,null,null,null,null,null,null,null,null,null,null,null,null,null,null,null,null,null,null,null,null,null,null,null,null,null,0,{"$f":"IF(PARCIAL1!L$8=0,0,(ROUND(((BF71*10)/PARCIAL1!L$8),1)))","v":0},null,null,0,0,0,0,0,0,0,0,0,0,0,0,0,0,0,0,0,0,0,0,0,0,0,0,0,0,0,0,0,0,0,0,0,0,0,0,0,0,0,0,0,0,0,0,0,0,0,0,0,0,0,0,{"$f":"IF(#REF!>$Y$3,0,#REF!)","v":{"$error":"#REF!"}},{"$f":"IF(#REF!>$Y$3,0,#REF!)","v":{"$error":"#REF!"}},{"$f":"IF(#REF!>$Y$3,0,#REF!)","v":{"$error":"#REF!"}},{"$f":"IF(#REF!>$Y$3,0,#REF!)","v":{"$error":"#REF!"}},{"$f":"IF(#REF!>$Y$3,0,#REF!)","v":{"$error":"#REF!"}},{"$f":"IF(#REF!>$Y$3,0,#REF!)","v":{"$error":"#REF!"}},{"$f":"IF(#REF!>$Y$3,0,#REF!)","v":{"$error":"#REF!"}},{"$f":"IF(#REF!>$Y$3,0,#REF!)","v":{"$error":"#REF!"}},{"$f":"IF(#REF!>$Y$3,0,#REF!)","v":{"$error":"#REF!"}},{"$f":"IF(#REF!>$Y$3,0,#REF!)","v":{"$error":"#REF!"}},{"$f":"IF(#REF!>$Y$3,0,#REF!)","v":{"$error":"#REF!"}},{"$f":"IF(#REF!>$Y$3,0,#REF!)","v":{"$error":"#REF!"}},{"$f":"IF(#REF!>$Y$3,0,#REF!)","v":{"$error":"#REF!"}},{"$f":"IF(#REF!>$Y$3,0,#REF!)","v":{"$error":"#REF!"}},{"$f":"IF(#REF!>$Y$3,0,#REF!)","v":{"$error":"#REF!"}},{"$f":"IF(#REF!>$Y$3,0,#REF!)","v":{"$error":"#REF!"}},{"$f":"IF(#REF!>$Y$3,0,#REF!)","v":{"$error":"#REF!"}},{"$f":"IF(#REF!>$Y$3,0,#REF!)","v":{"$error":"#REF!"}},{"$f":"IF(#REF!>$Y$3,0,#REF!)","v":{"$error":"#REF!"}},{"$f":"IF(#REF!>$Y$3,0,#REF!)","v":{"$error":"#REF!"}},{"$f":"IF(#REF!>$Y$3,0,#REF!)","v":{"$error":"#REF!"}},{"$f":"IF(#REF!>$Y$3,0,#REF!)","v":{"$error":"#REF!"}},{"$f":"IF(#REF!>$Y$3,0,#REF!)","v":{"$error":"#REF!"}},{"$f":"IF(#REF!>$Y$3,0,#REF!)","v":{"$error":"#REF!"}},{"$f":"IF(#REF!>$Y$3,0,#REF!)","v":{"$error":"#REF!"}},{"$f":"IF(#REF!>$Y$3,0,#REF!)","v":{"$error":"#REF!"}},{"$f":"IF(#REF!>$Y$3,0,#REF!)","v":{"$error":"#REF!"}},{"$f":"IF(#REF!>$Y$3,0,#REF!)","v":{"$error":"#REF!"}}]
[null,null,68,null,null,null,null,null,null,null,null,null,null,null,null,null,null,null,null,null,null,null,null,null,null,null,null,null,null,null,null,null,null,null,null,null,null,null,null,null,null,null,null,null,null,null,null,null,null,null,null,null,null,null,null,null,null,{"$f":"SUM(F72:BE72)","v":0},{"$f":"IF(PARCIAL1!L$8=0,0,(ROUND(((BF72*10)/PARCIAL1!L$8),1)))","v":0},null,null,0,0,0,0,0,0,0,0,0,0,0,0,0,0,0,0,0,0,0,0,0,0,0,0,0,0,0,0,0,0,0,0,0,0,0,0,0,0,0,0,0,0,0,0,0,0,0,0,0,0,0,0,{"$f":"IF(#REF!>$Y$3,0,#REF!)","v":{"$error":"#REF!"}},{"$f":"IF(#REF!>$Y$3,0,#REF!)","v":{"$error":"#REF!"}},{"$f":"IF(#REF!>$Y$3,0,#REF!)","v":{"$error":"#REF!"}},{"$f":"IF(#REF!>$Y$3,0,#REF!)","v":{"$error":"#REF!"}},{"$f":"IF(#REF!>$Y$3,0,#REF!)","v":{"$error":"#REF!"}},{"$f":"IF(#REF!>$Y$3,0,#REF!)","v":{"$error":"#REF!"}},{"$f":"IF(#REF!>$Y$3,0,#REF!)","v":{"$error":"#REF!"}},{"$f":"IF(#REF!>$Y$3,0,#REF!)","v":{"$error":"#REF!"}},{"$f":"IF(#REF!>$Y$3,0,#REF!)","v":{"$error":"#REF!"}},{"$f":"IF(#REF!>$Y$3,0,#REF!)","v":{"$error":"#REF!"}},{"$f":"IF(#REF!>$Y$3,0,#REF!)","v":{"$error":"#REF!"}},{"$f":"IF(#REF!>$Y$3,0,#REF!)","v":{"$error":"#REF!"}},{"$f":"IF(#REF!>$Y$3,0,#REF!)","v":{"$error":"#REF!"}},{"$f":"IF(#REF!>$Y$3,0,#REF!)","v":{"$error":"#REF!"}},{"$f":"IF(#REF!>$Y$3,0,#REF!)","v":{"$error":"#REF!"}},{"$f":"IF(#REF!>$Y$3,0,#REF!)","v":{"$error":"#REF!"}},{"$f":"IF(#REF!>$Y$3,0,#REF!)","v":{"$error":"#REF!"}},{"$f":"IF(#REF!>$Y$3,0,#REF!)","v":{"$error":"#REF!"}},{"$f":"IF(#REF!>$Y$3,0,#REF!)","v":{"$error":"#REF!"}},{"$f":"IF(#REF!>$Y$3,0,#REF!)","v":{"$error":"#REF!"}},{"$f":"IF(#REF!>$Y$3,0,#REF!)","v":{"$error":"#REF!"}},{"$f":"IF(#REF!>$Y$3,0,#REF!)","v":{"$error":"#REF!"}},{"$f":"IF(#REF!>$Y$3,0,#REF!)","v":{"$error":"#REF!"}},{"$f":"IF(#REF!>$Y$3,0,#REF!)","v":{"$error":"#REF!"}},{"$f":"IF(#REF!>$Y$3,0,#REF!)","v":{"$error":"#REF!"}},{"$f":"IF(#REF!>$Y$3,0,#REF!)","v":{"$error":"#REF!"}},{"$f":"IF(#REF!>$Y$3,0,#REF!)","v":{"$error":"#REF!"}},{"$f":"IF(#REF!>$Y$3,0,#REF!)","v":{"$error":"#REF!"}}]
[null,null,69,null,null,null,null,null,null,null,null,null,null,null,null,null,null,null,null,null,null,null,null,null,null,null,null,null,null,null,null,null,null,null,null,null,null,null,null,null,null,null,null,null,null,null,null,null,null,null,null,null,null,null,null,null,null,0,{"$f":"IF(PARCIAL1!L$8=0,0,(ROUND(((BF73*10)/PARCIAL1!L$8),1)))","v":0},null,null,0,0,0,0,0,0,0,0,0,0,0,0,0,0,0,0,0,0,0,0,0,0,0,0,0,0,0,0,0,0,0,0,0,0,0,0,0,0,0,0,0,0,0,0,0,0,0,0,0,0,0,0,{"$f":"IF(#REF!>$Y$3,0,#REF!)","v":{"$error":"#REF!"}},{"$f":"IF(#REF!>$Y$3,0,#REF!)","v":{"$error":"#REF!"}},{"$f":"IF(#REF!>$Y$3,0,#REF!)","v":{"$error":"#REF!"}},{"$f":"IF(#REF!>$Y$3,0,#REF!)","v":{"$error":"#REF!"}},{"$f":"IF(#REF!>$Y$3,0,#REF!)","v":{"$error":"#REF!"}},{"$f":"IF(#REF!>$Y$3,0,#REF!)","v":{"$error":"#REF!"}},{"$f":"IF(#REF!>$Y$3,0,#REF!)","v":{"$error":"#REF!"}},{"$f":"IF(#REF!>$Y$3,0,#REF!)","v":{"$error":"#REF!"}},{"$f":"IF(#REF!>$Y$3,0,#REF!)","v":{"$error":"#REF!"}},{"$f":"IF(#REF!>$Y$3,0,#REF!)","v":{"$error":"#REF!"}},{"$f":"IF(#REF!>$Y$3,0,#REF!)","v":{"$error":"#REF!"}},{"$f":"IF(#REF!>$Y$3,0,#REF!)","v":{"$error":"#REF!"}},{"$f":"IF(#REF!>$Y$3,0,#REF!)","v":{"$error":"#REF!"}},{"$f":"IF(#REF!>$Y$3,0,#REF!)","v":{"$error":"#REF!"}},{"$f":"IF(#REF!>$Y$3,0,#REF!)","v":{"$error":"#REF!"}},{"$f":"IF(#REF!>$Y$3,0,#REF!)","v":{"$error":"#REF!"}},{"$f":"IF(#REF!>$Y$3,0,#REF!)","v":{"$error":"#REF!"}},{"$f":"IF(#REF!>$Y$3,0,#REF!)","v":{"$error":"#REF!"}},{"$f":"IF(#REF!>$Y$3,0,#REF!)","v":{"$error":"#REF!"}},{"$f":"IF(#REF!>$Y$3,0,#REF!)","v":{"$error":"#REF!"}},{"$f":"IF(#REF!>$Y$3,0,#REF!)","v":{"$error":"#REF!"}},{"$f":"IF(#REF!>$Y$3,0,#REF!)","v":{"$error":"#REF!"}},{"$f":"IF(#REF!>$Y$3,0,#REF!)","v":{"$error":"#REF!"}},{"$f":"IF(#REF!>$Y$3,0,#REF!)","v":{"$error":"#REF!"}},{"$f":"IF(#REF!>$Y$3,0,#REF!)","v":{"$error":"#REF!"}},{"$f":"IF(#REF!>$Y$3,0,#REF!)","v":{"$error":"#REF!"}},{"$f":"IF(#REF!>$Y$3,0,#REF!)","v":{"$error":"#REF!"}},{"$f":"IF(#REF!>$Y$3,0,#REF!)","v":{"$error":"#REF!"}}]
[null,null,70,null,null,null,null,null,null,null,null,null,null,null,null,null,null,null,null,null,null,null,null,null,null,null,null,null,null,null,null,null,null,null,null,null,null,null,null,null,null,null,null,null,null,null,null,null,null,null,null,null,null,null,null,null,null,0,{"$f":"IF(PARCIAL1!L$8=0,0,(ROUND(((BF74*10)/PARCIAL1!L$8),1)))","v":0},null,null,0,0,0,0,0,0,0,0,0,0,0,0,0,0,0,0,0,0,0,0,0,0,0,0,0,0,0,0,0,0,0,0,0,0,0,0,0,0,0,0,0,0,0,0,0,0,0,0,0,0,0,0,{"$f":"IF(#REF!>$Y$3,0,#REF!)","v":{"$error":"#REF!"}},{"$f":"IF(#REF!>$Y$3,0,#REF!)","v":{"$error":"#REF!"}},{"$f":"IF(#REF!>$Y$3,0,#REF!)","v":{"$error":"#REF!"}},{"$f":"IF(#REF!>$Y$3,0,#REF!)","v":{"$error":"#REF!"}},{"$f":"IF(#REF!>$Y$3,0,#REF!)","v":{"$error":"#REF!"}},{"$f":"IF(#REF!>$Y$3,0,#REF!)","v":{"$error":"#REF!"}},{"$f":"IF(#REF!>$Y$3,0,#REF!)","v":{"$error":"#REF!"}},{"$f":"IF(#REF!>$Y$3,0,#REF!)","v":{"$error":"#REF!"}},{"$f":"IF(#REF!>$Y$3,0,#REF!)","v":{"$error":"#REF!"}},{"$f":"IF(#REF!>$Y$3,0,#REF!)","v":{"$error":"#REF!"}},{"$f":"IF(#REF!>$Y$3,0,#REF!)","v":{"$error":"#REF!"}},{"$f":"IF(#REF!>$Y$3,0,#REF!)","v":{"$error":"#REF!"}},{"$f":"IF(#REF!>$Y$3,0,#REF!)","v":{"$error":"#REF!"}},{"$f":"IF(#REF!>$Y$3,0,#REF!)","v":{"$error":"#REF!"}},{"$f":"IF(#REF!>$Y$3,0,#REF!)","v":{"$error":"#REF!"}},{"$f":"IF(#REF!>$Y$3,0,#REF!)","v":{"$error":"#REF!"}},{"$f":"IF(#REF!>$Y$3,0,#REF!)","v":{"$error":"#REF!"}},{"$f":"IF(#REF!>$Y$3,0,#REF!)","v":{"$error":"#REF!"}},{"$f":"IF(#REF!>$Y$3,0,#REF!)","v":{"$error":"#REF!"}},{"$f":"IF(#REF!>$Y$3,0,#REF!)","v":{"$error":"#REF!"}},{"$f":"IF(#REF!>$Y$3,0,#REF!)","v":{"$error":"#REF!"}},{"$f":"IF(#REF!>$Y$3,0,#REF!)","v":{"$error":"#REF!"}},{"$f":"IF(#REF!>$Y$3,0,#REF!)","v":{"$error":"#REF!"}},{"$f":"IF(#REF!>$Y$3,0,#REF!)","v":{"$error":"#REF!"}},{"$f":"IF(#REF!>$Y$3,0,#REF!)","v":{"$error":"#REF!"}},{"$f":"IF(#REF!>$Y$3,0,#REF!)","v":{"$error":"#REF!"}},{"$f":"IF(#REF!>$Y$3,0,#REF!)","v":{"$error":"#REF!"}},{"$f":"IF(#REF!>$Y$3,0,#REF!)","v":{"$error":"#REF!"}}]

{"sheet":"DOC1","index":2,"n_rows":75,"n_cols":18,"rows_kept":75,"cut":false,"hidden":false,"merged":[[3,17,4,17],[1,2,1,17],[2,2,2,17],[3,4,4,4],[3,3,4,3],[3,2,4,2],[3,16,4,16],[3,15,4,15]]}
[]
[null,null,"Aprendizaje\n en contacto\n con el\n docente - PRIMER PARCIAL"]
[null,null,"Conferencias, Seminarios, Estudios de Casos, Foros, Clases en Línea, Servicios realizados en escenarios laborables. Experiencias colectivas en proyectos: sistematización de prácticas de investigación-intervención, proyectos de integración de saberes, construcción de modelos y prototipos, proyectos de problematización, resolución de problemas, entornos virtuales, entre otros. Evaluaciones orales, escritas entre otras."]
[null,null,"N","NRO DE CÉDULA","NOMINA",1,2,3,4,5,6,7,8,9,10,"suma","PROMEDIO sobre 10","EQUIVALENCIA sobre 3,5"]
[null,null,null,null,null,"Parcial I","EXPOSICIÓN Inducción - conducción 10/10/24","EXPOSICIÓN\nDolor del parto y estrategias","EXPOSICIÓN Puerperio 29/10/24  - 5-6-7/11/24 ","PARTICIPACIÓN","EXPOSICIÓN Trast. H del E. 12-13-14/11/24 ","LECCIÓN 14/11/24 ","EXPOSICIÓN Alto Riesgo Obst. 19/11/24","EXPOSICIÓN Pruebas Prenatales y valoración en el embarazo de  ARO 21-26/11/24"]
[null,null,1,{"$f":"IF('AS1'!D5=\"\",\"\",'AS1'!D5)","v":""},{"$f":"IF('AS1'!E5=\"\",\"\",'AS1'!E5)","v":"DAQUILEMA LONDO SHIRLEY ESTEFAFANÍA"},7.8,4.8,9.4,null,null,8.5,7,null,null,null,{"$f":"IF(COUNT(F6:O6)=0,\"\",SUM(F6:O6))","v":37.5},{"$f":"IF(COUNT(F6:O6)=0,0,ROUND(P6/COUNT(F6:O6),2))","v":7.5},{"$f":"(Q6*3.5)/10","v":2.625}]
[null,null,2,{"$f":"IF('AS1'!D6=\"\",\"\",'AS1'!D6)","v":""},{"$f":"IF('AS1'!E6=\"\",\"\",'AS1'!E6)","v":"GOYES ORTIZ NATASHA DAYANA"},6.6,9,null,null,10,null,null,null,null,null,25.6,8.5299999999999994,2.9854999999999996]
[null,null,3,{"$f":"IF('AS1'!D7=\"\",\"\",'AS1'!D7)","v":""},{"$f":"IF('AS1'!E7=\"\",\"\",'AS1'!E7)","v":"GUADALUPE RUIZ YULISA NATALY"},6.6,7.4,7.8,null,10,8,6,null,null,null,45.8,7.63,2.6704999999999997]
[null,null,4,{"$f":"IF('AS1'!D8=\"\",\"\",'AS1'!D8)","v":""},{"$f":"IF('AS1'!E8=\"\",\"\",'AS1'!E8)","v":"MELO CHAVEZ KEVIN JOSUE"},8.6,7.6,null,9,10,null,8.5,8,null,null,51.7,8.6199999999999992,3.0169999999999999]
[null,null,5,{"$f":"IF('AS1'!D9=\"\",\"\",'AS1'!D9)","v":""},{"$f":"IF('AS1'!E9=\"\",\"\",'AS1'!E9)","v":"MULLO PAUCAR ADRIANA ANABEL"},6.6,null,null,9.8000000000000007,10,null,8.5,null,9,null,43.9,8.7799999999999994,3.0729999999999995]
[null,null,6,{"$f":"IF('AS1'!D10=\"\",\"\",'AS1'!D10)","v":""},{"$f":"IF('AS1'!E10=\"\",\"\",'AS1'!E10)","v":"NARANJO PALACIOS FERNANDA BRIGUITTE"},null,null,null,null,null,null,null,null,null,null,"",0,0]
[null,null,7,{"$f":"IF('AS1'!D11=\"\",\"\",'AS1'!D11)","v":""},{"$f":"IF('AS1'!E11=\"\",\"\",'AS1'!E11)","v":"SOTO VARGAS ERIKA SAMANTA"},4.8,null,null,6.5,null,null,6,null,9,null,26.3,6.58,2.3029999999999999]
[null,null,8,{"$f":"IF('AS1'!D12=\"\",\"\",'AS1'!D12)","v":""},{"$f":"IF('AS1'!E12=\"\",\"\",'AS1'!E12)","v":"VALLEJO ORDOÑEZ SAYONARA ELIZABETH"},7.2,null,null,7.26,null,null,6,7.4,null,null,27.86,6.97,2.4394999999999998]
[null,null,9,{"$f":"IF('AS1'!D13=\"\",\"\",'AS1'!D13)","v":""},{"$f":"IF('AS1'!E13=\"\",\"\",'AS1'!E13)","v":""},null,null,null,null,null,null,null,null,null,null,"",0,0]
[null,null,10,{"$f":"IF('AS1'!D14=\"\",\"\",'AS1'!D14)","v":""},{"$f":"IF('AS1'!E14=\"\",\"\",'AS1'!E14)","v":""},null,null,null,null,null,null,null,null,null,null,"",0,0]
[null,null,11,{"$f":"IF('AS1'!D15=\"\",\"\",'AS1'!D15)","v":""},{"$f":"IF('AS1'!E15=\"\",\"\",'AS1'!E15)","v":""},null,null,null,null,null,null,null,null,null,null,"",0,0]
[null,null,12,{"$f":"IF('AS1'!D16=\"\",\"\",'AS1'!D16)","v":""},{"$f":"IF('AS1'!E16=\"\",\"\",'AS1'!E16)","v":""},null,null,null,null,null,null,null,null,null,null,"",0,0]
[null,null,13,{"$f":"IF('AS1'!D17=\"\",\"\",'AS1'!D17)","v":""},{"$f":"IF('AS1'!E17=\"\",\"\",'AS1'!E17)","v":""},null,null,null,null,null,null,null,null,null,null,"",0,0]
[null,null,14,{"$f":"IF('AS1'!D18=\"\",\"\",'AS1'!D18)","v":""},{"$f":"IF('AS1'!E18=\"\",\"\",'AS1'!E18)","v":""},null,null,null,null,null,null,null,null,null,null,"",0,0]
[null,null,15,{"$f":"IF('AS1'!D19=\"\",\"\",'AS1'!D19)","v":""},{"$f":"IF('AS1'!E19=\"\",\"\",'AS1'!E19)","v":""},null,null,null,null,null,null,null,null,null,null,"",0,0]
[null,null,16,{"$f":"IF('AS1'!D20=\"\",\"\",'AS1'!D20)","v":""},{"$f":"IF('AS1'!E20=\"\",\"\",'AS1'!E20)","v":""},null,null,null,null,null,null,null,null,null,null,"",0,0]
[null,null,17,{"$f":"IF('AS1'!D21=\"\",\"\",'AS1'!D21)","v":""},{"$f":"IF('AS1'!E21=\"\",\"\",'AS1'!E21)","v":""},null,null,null,null,null,null,null,null,null,null,"",0,0]
[null,null,18,{"$f":"IF('AS1'!D22=\"\",\"\",'AS1'!D22)","v":""},{"$f":"IF('AS1'!E22=\"\",\"\",'AS1'!E22)","v":""},null,null,null,null,null,null,null,null,null,null,"",0,0]
[null,null,19,{"$f":"IF('AS1'!D23=\"\",\"\",'AS1'!D23)","v":""},{"$f":"IF('AS1'!E23=\"\",\"\",'AS1'!E23)","v":""},null,null,null,null,null,null,null,null,null,null,"",0,0]
[null,null,20,{"$f":"IF('AS1'!D24=\"\",\"\",'AS1'!D24)","v":""},{"$f":"IF('AS1'!E24=\"\",\"\",'AS1'!E24)","v":""},null,null,null,null,null,null,null,null,null,null,"",0,0]
[null,null,21,{"$f":"IF('AS1'!D25=\"\",\"\",'AS1'!D25)","v":""},{"$f":"IF('AS1'!E25=\"\",\"\",'AS1'!E25)","v":""},null,null,null,null,null,null,null,null,null,null,"",0,0]
[null,null,22,{"$f":"IF('AS1'!D26=\"\",\"\",'AS1'!D26)","v":""},{"$f":"IF('AS1'!E26=\"\",\"\",'AS1'!E26)","v":""},null,null,null,null,null,null,null,null,null,null,"",0,0]
[null,null,23,{"$f":"IF('AS1'!D27=\"\",\"\",'AS1'!D27)","v":""},{"$f":"IF('AS1'!E27=\"\",\"\",'AS1'!E27)","v":""},null,null,null,null,null,null,null,null,null,null,"",0,0]
[null,null,24,{"$f":"IF('AS1'!D28=\"\",\"\",'AS1'!D28)","v":""},{"$f":"IF('AS1'!E28=\"\",\"\",'AS1'!E28)","v":""},null,null,null,null,null,null,null,null,null,null,"",0,0]
[null,null,25,{"$f":"IF('AS1'!D29=\"\",\"\",'AS1'!D29)","v":""},{"$f":"IF('AS1'!E29=\"\",\"\",'AS1'!E29)","v":""},null,null,null,null,null,null,null,null,null,null,"",0,0]
[null,null,26,{"$f":"IF('AS1'!D30=\"\",\"\",'AS1'!D30)","v":""},{"$f":"IF('AS1'!E30=\"\",\"\",'AS1'!E30)","v":""},null,null,null,null,null,null,null,null,null,null,"",0,0]
[null,null,27,{"$f":"IF('AS1'!D31=\"\",\"\",'AS1'!D31)","v":""},{"$f":"IF('AS1'!E31=\"\",\"\",'AS1'!E31)","v":""},null,null,null,null,null,null,null,null,null,null,"",0,0]
[null,null,28,{"$f":"IF('AS1'!D32=\"\",\"\",'AS1'!D32)","v":""},{"$f":"IF('AS1'!E32=\"\",\"\",'AS1'!E32)","v":""},null,null,null,null,null,null,null,null,null,null,"",0,0]
[null,null,29,{"$f":"IF('AS1'!D33=\"\",\"\",'AS1'!D33)","v":""},{"$f":"IF('AS1'!E33=\"\",\"\",'AS1'!E33)","v":""},null,null,null,null,null,null,null,null,null,null,"",0,0]
[null,null,30,{"$f":"IF('AS1'!D34=\"\",\"\",'AS1'!D34)","v":""},{"$f":"IF('AS1'!E34=\"\",\"\",'AS1'!E34)","v":""},null,null,null,null,null,null,null,null,null,null,"",0,0]
[null,null,31,{"$f":"IF('AS1'!D35=\"\",\"\",'AS1'!D35)","v":""},{"$f":"IF('AS1'!E35=\"\",\"\",'AS1'!E35)","v":""},null,null,null,null,null,null,null,null,null,null,"",0,0]
[null,null,32,{"$f":"IF('AS1'!D36=\"\",\"\",'AS1'!D36)","v":""},{"$f":"IF('AS1'!E36=\"\",\"\",'AS1'!E36)","v":""},null,null,null,null,null,null,null,null,null,null,"",0,0]
[null,null,33,{"$f":"IF('AS1'!D37=\"\",\"\",'AS1'!D37)","v":""},{"$f":"IF('AS1'!E37=\"\",\"\",'AS1'!E37)","v":""},null,null,null,null,null,null,null,null,null,null,{"$f":"IF(COUNT(F38:O38)=0,\"\",SUM(F38:O38))","v":""},{"$f":"IF(COUNT(F38:O38)=0,0,ROUND(P38/COUNT(F38:O38),2))","v":0},0]
[null,null,34,{"$f":"IF('AS1'!D38=\"\",\"\",'AS1'!D38)","v":""},{"$f":"IF('AS1'!E38=\"\",\"\",'AS1'!E38)","v":""},null,null,null,null,null,null,null,null,null,null,"",0,0]
[null,null,35,{"$f":"IF('AS1'!D39=\"\",\"\",'AS1'!D39)","v":""},{"$f":"IF('AS1'!E39=\"\",\"\",'AS1'!E39)","v":""},null,null,null,null,null,null,null,null,null,null,"",0,0]
[null,null,36,{"$f":"IF('AS1'!D40=\"\",\"\",'AS1'!D40)","v":""},{"$f":"IF('AS1'!E40=\"\",\"\",'AS1'!E40)","v":""},null,null,null,null,null,null,null,null,null,null,"",0,0]
[null,null,37,{"$f":"IF('AS1'!D41=\"\",\"\",'AS1'!D41)","v":""},{"$f":"IF('AS1'!E41=\"\",\"\",'AS1'!E41)","v":""},null,null,null,null,null,null,null,null,null,null,"",0,0]
[null,null,38,{"$f":"IF('AS1'!D42=\"\",\"\",'AS1'!D42)","v":""},{"$f":"IF('AS1'!E42=\"\",\"\",'AS1'!E42)","v":""},null,null,null,null,null,null,null,null,null,null,"",0,0]
[null,null,39,{"$f":"IF('AS1'!D43=\"\",\"\",'AS1'!D43)","v":""},{"$f":"IF('AS1'!E43=\"\",\"\",'AS1'!E43)","v":""},null,null,null,null,null,null,null,null,null,null,"",0,0]
[null,null,40,{"$f":"IF('AS1'!D44=\"\",\"\",'AS1'!D44)","v":""},{"$f":"IF('AS1'!E44=\"\",\"\",'AS1'!E44)","v":""},null,null,null,null,null,null,null,null,null,null,"",0,0]
[null,null,41,{"$f":"IF('AS1'!D45=\"\",\"\",'AS1'!D45)","v":""},{"$f":"IF('AS1'!E45=\"\",\"\",'AS1'!E45)","v":""},null,null,null,null,null,null,null,null,null,null,"",0,0]
[null,null,42,{"$f":"IF('AS1'!D46=\"\",\"\",'AS1'!D46)","v":""},{"$f":"IF('AS1'!E46=\"\",\"\",'AS1'!E46)","v":""},null,null,null,null,null,null,null,null,null,null,"",0,0]
[null,null,43,{"$f":"IF('AS1'!D47=\"\",\"\",'AS1'!D47)","v":""},{"$f":"IF('AS1'!E47=\"\",\"\",'AS1'!E47)","v":""},null,null,null,null,null,null,null,null,null,null,"",0,0]
[null,null,44,{"$f":"IF('AS1'!D48=\"\",\"\",'AS1'!D48)","v":""},{"$f":"IF('AS1'!E48=\"\",\"\",'AS1'!E48)","v":""},null,null,null,null,null,null,null,null,null,null,"",0,0]
[null,null,45,{"$f":"IF('AS1'!D49=\"\",\"\",'AS1'!D49)","v":""},{"$f":"IF('AS1'!E49=\"\",\"\",'AS1'!E49)","v":""},null,null,null,null,null,null,null,null,null,null,"",0,0]
[null,null,46,{"$f":"IF('AS1'!D50=\"\",\"\",'AS1'!D50)","v":""},{"$f":"IF('AS1'!E50=\"\",\"\",'AS1'!E50)","v":""},null,null,null,null,null,null,null,null,null,null,"",0,0]
[null,null,47,{"$f":"IF('AS1'!D51=\"\",\"\",'AS1'!D51)","v":""},{"$f":"IF('AS1'!E51=\"\",\"\",'AS1'!E51)","v":""},null,null,null,null,null,null,null,null,null,null,"",0,0]
[null,null,48,{"$f":"IF('AS1'!D52=\"\",\"\",'AS1'!D52)","v":""},{"$f":"IF('AS1'!E52=\"\",\"\",'AS1'!E52)","v":""},null,null,null,null,null,null,null,null,null,null,"",0,0]
[null,null,49,{"$f":"IF('AS1'!D53=\"\",\"\",'AS1'!D53)","v":""},{"$f":"IF('AS1'!E53=\"\",\"\",'AS1'!E53)","v":""},null,null,null,null,null,null,null,null,null,null,"",0,0]
[null,null,50,{"$f":"IF('AS1'!D54=\"\",\"\",'AS1'!D54)","v":""},{"$f":"IF('AS1'!E54=\"\",\"\",'AS1'!E54)","v":""},null,null,null,null,null,null,null,null,null,null,"",0,0]
[null,null,51,{"$f":"IF('AS1'!D55=\"\",\"\",'AS1'!D55)","v":""},{"$f":"IF('AS1'!E55=\"\",\"\",'AS1'!E55)","v":""},null,null,null,null,null,null,null,null,null,null,"",0,0]
[null,null,52,{"$f":"IF('AS1'!D56=\"\",\"\",'AS1'!D56)","v":""},{"$f":"IF('AS1'!E56=\"\",\"\",'AS1'!E56)","v":""},null,null,null,null,null,null,null,null,null,null,"",0,0]
[null,null,53,{"$f":"IF('AS1'!D57=\"\",\"\",'AS1'!D57)","v":""},{"$f":"IF('AS1'!E57=\"\",\"\",'AS1'!E57)","v":""},null,null,null,null,null,null,null,null,null,null,"",0,0]
[null,null,54,{"$f":"IF('AS1'!D58=\"\",\"\",'AS1'!D58)","v":""},{"$f":"IF('AS1'!E58=\"\",\"\",'AS1'!E58)","v":""},null,null,null,null,null,null,null,null,null,null,"",0,0]
[null,null,55,{"$f":"IF('AS1'!D59=\"\",\"\",'AS1'!D59)","v":""},{"$f":"IF('AS1'!E59=\"\",\"\",'AS1'!E59)","v":""},null,null,null,null,null,null,null,null,null,null,"",0,{"$f":"(Q60*3.5)/10","v":0}]
[null,null,56,{"$f":"IF('AS1'!D60=\"\",\"\",'AS1'!D60)","v":""},{"$f":"IF('AS1'!E60=\"\",\"\",'AS1'!E60)","v":""},null,null,null,null,null,null,null,null,null,null,"",0,0]
[null,null,57,{"$f":"IF('AS1'!D61=\"\",\"\",'AS1'!D61)","v":""},{"$f":"IF('AS1'!E61=\"\",\"\",'AS1'!E61)","v":""},null,null,null,null,null,null,null,null,null,null,"",0,0]
[null,null,58,{"$f":"IF('AS1'!D62=\"\",\"\",'AS1'!D62)","v":""},{"$f":"IF('AS1'!E62=\"\",\"\",'AS1'!E62)","v":""},null,null,null,null,null,null,null,null,null,null,"",0,0]
[null,null,59,{"$f":"IF('AS1'!D63=\"\",\"\",'AS1'!D63)","v":""},{"$f":"IF('AS1'!E63=\"\",\"\",'AS1'!E63)","v":""},null,null,null,null,null,null,null,null,null,null,"",0,0]
[null,null,60,{"$f":"IF('AS1'!D64=\"\",\"\",'AS1'!D64)","v":""},{"$f":"IF('AS1'!E64=\"\",\"\",'AS1'!E64)","v":""},null,null,null,null,null,null,null,null,null,null,"",0,0]
[null,null,61,{"$f":"IF('AS1'!D65=\"\",\"\",'AS1'!D65)","v":""},{"$f":"IF('AS1'!E65=\"\",\"\",'AS1'!E65)","v":""},null,null,null,null,null,null,null,null,null,null,"",0,0]
[null,null,62,{"$f":"IF('AS1'!D66=\"\",\"\",'AS1'!D66)","v":""},{"$f":"IF('AS1'!E66=\"\",\"\",'AS1'!E66)","v":""},null,null,null,null,null,null,null,null,null,null,"",0,0]
[null,null,63,{"$f":"IF('AS1'!D67=\"\",\"\",'AS1'!D67)","v":""},{"$f":"IF('AS1'!E67=\"\",\"\",'AS1'!E67)","v":""},null,null,null,null,null,null,null,null,null,null,"",0,0]
[null,null,64,{"$f":"IF('AS1'!D68=\"\",\"\",'AS1'!D68)","v":""},{"$f":"IF('AS1'!E68=\"\",\"\",'AS1'!E68)","v":""},null,null,null,null,null,null,null,null,null,null,"",0,0]
[null,null,65,{"$f":"IF('AS1'!D69=\"\",\"\",'AS1'!D69)","v":""},{"$f":"IF('AS1'!E69=\"\",\"\",'AS1'!E69)","v":""},null,null,null,null,null,null,null,null,null,null,{"$f":"IF(COUNT(F70:O70)=0,\"\",SUM(F70:O70))","v":""},{"$f":"IF(COUNT(F70:O70)=0,0,ROUND(P70/COUNT(F70:O70),2))","v":0},0]
[null,null,66,{"$f":"IF('AS1'!D70=\"\",\"\",'AS1'!D70)","v":""},{"$f":"IF('AS1'!E70=\"\",\"\",'AS1'!E70)","v":""},null,null,null,null,null,null,null,null,null,null,"",0,0]
[null,null,67,{"$f":"IF('AS1'!D71=\"\",\"\",'AS1'!D71)","v":""},{"$f":"IF('AS1'!E71=\"\",\"\",'AS1'!E71)","v":""},null,null,null,null,null,null,null,null,null,null,"",0,0]
[null,null,68,{"$f":"IF('AS1'!D72=\"\",\"\",'AS1'!D72)","v":""},{"$f":"IF('AS1'!E72=\"\",\"\",'AS1'!E72)","v":""},null,null,null,null,null,null,null,null,null,null,"",0,0]
[null,null,69,{"$f":"IF('AS1'!D73=\"\",\"\",'AS1'!D73)","v":""},{"$f":"IF('AS1'!E73=\"\",\"\",'AS1'!E73)","v":""},null,null,null,null,null,null,null,null,null,null,"",0,0]
[null,null,70,{"$f":"IF('AS1'!D74=\"\",\"\",'AS1'!D74)","v":""},{"$f":"IF('AS1'!E74=\"\",\"\",'AS1'!E74)","v":""},null,null,null,null,null,null,null,null,null,null,"",0,0]

{"sheet":"PRAC1","index":3,"n_rows":75,"n_cols":18,"rows_kept":75,"cut":false,"hidden":false,"merged":[[1,2,1,17],[2,2,2,17],[3,2,4,2],[3,3,4,3],[3,4,4,4],[3,15,4,15],[3,16,4,16],[3,17,4,17]]}
[]
[null,null,"Aprendizaje \npráctico experimental - PRIMER PARCIAL"]
[null,null,"Actividades desarrolladas en escenarios experimentales o laboratorios, prácticas de campo, trabajos de observación, resolución de problemas, talleres, manejo de base de datos y acervos bibliográficos entre otros. "]
[null,null,"N","NRO DE CÉDULA","NOMINA",1,2,3,4,5,6,7,8,9,10,"suma","PROMEDIO sobre 10","EQUIVALENCIA sobre 3,5"]
[null,null,null,null,null,"Lic. M. Londo","Graciela Rivera Psicoprofilaxis","Práctica hospitalaria"]
[null,null,1,{"$f":"IF('AS1'!D5=\"\",\"\",'AS1'!D5)","v":""},{"$f":"IF('AS1'!E5=\"\",\"\",'AS1'!E5)","v":"DAQUILEMA LONDO SHIRLEY ESTEFAFANÍA"},7.36,null,6.3,null,null,null,null,null,null,null,{"$f":"IF(COUNT(F6:O6)=0,\"\",SUM(F6:O6))","v":13.66},{"$f":"IF(COUNT(F6:O6)=0,0,ROUND(P6/COUNT(F6:O6),2))","v":6.83},{"$f":"(Q6*3.5)/10","v":2.3905000000000003}]
[null,null,2,{"$f":"IF('AS1'!D6=\"\",\"\",'AS1'!D6)","v":""},{"$f":"IF('AS1'!E6=\"\",\"\",'AS1'!E6)","v":"GOYES ORTIZ NATASHA DAYANA"},7.45,9.1999999999999993,7.1,null,null,null,null,null,null,null,23.75,7.92,{"$f":"(Q7*3.5)/10","v":2.7719999999999998}]
[null,null,3,{"$f":"IF('AS1'!D7=\"\",\"\",'AS1'!D7)","v":""},{"$f":"IF('AS1'!E7=\"\",\"\",'AS1'!E7)","v":"GUADALUPE RUIZ YULISA NATALY"},7.06,null,5.0999999999999996,null,null,null,null,null,null,null,12.16,6.08,{"$f":"(Q8*3.5)/10","v":2.1280000000000001}]
[null,null,4,{"$f":"IF('AS1'!D8=\"\",\"\",'AS1'!D8)","v":""},{"$f":"IF('AS1'!E8=\"\",\"\",'AS1'!E8)","v":"MELO CHAVEZ KEVIN JOSUE"},6.74,null,6.3,null,null,null,null,null,null,null,13.04,6.52,2.282]
[null,null,5,{"$f":"IF('AS1'!D9=\"\",\"\",'AS1'!D9)","v":""},{"$f":"IF('AS1'!E9=\"\",\"\",'AS1'!E9)","v":"MULLO PAUCAR ADRIANA ANABEL"},6.79,null,7.1,null,null,null,null,null,null,null,13.89,6.95,2.4325000000000001]
[null,null,6,{"$f":"IF('AS1'!D10=\"\",\"\",'AS1'!D10)","v":""},{"$f":"IF('AS1'!E10=\"\",\"\",'AS1'!E10)","v":"NARANJO PALACIOS FERNANDA BRIGUITTE"},null,null,null,null,null,null,null,null,null,null,"",0,0]
[null,null,7,{"$f":"IF('AS1'!D11=\"\",\"\",'AS1'!D11)","v":""},{"$f":"IF('AS1'!E11=\"\",\"\",'AS1'!E11)","v":"SOTO VARGAS ERIKA SAMANTA"},6.76,null,7.5,null,null,null,null,null,null,null,14.26,7.13,2.4954999999999998]
[null,null,8,{"$f":"IF('AS1'!D12=\"\",\"\",'AS1'!D12)","v":""},{"$f":"IF('AS1'!E12=\"\",\"\",'AS1'!E12)","v":"VALLEJO ORDOÑEZ SAYONARA ELIZABETH"},6.6,null,5.3,null,null,null,null,null,null,null,11.899999999999999,5.95,2.0825]
[null,null,9,{"$f":"IF('AS1'!D13=\"\",\"\",'AS1'!D13)","v":""},{"$f":"IF('AS1'!E13=\"\",\"\",'AS1'!E13)","v":""},null,null,null,null,null,null,null,null,null,null,"",0,0]
[null,null,10,{"$f":"IF('AS1'!D14=\"\",\"\",'AS1'!D14)","v":""},{"$f":"IF('AS1'!E14=\"\",\"\",'AS1'!E14)","v":""},null,null,null,null,null,null,null,null,null,null,"",0,0]
[null,null,11,{"$f":"IF('AS1'!D15=\"\",\"\",'AS1'!D15)","v":""},{"$f":"IF('AS1'!E15=\"\",\"\",'AS1'!E15)","v":""},null,null,null,null,null,null,null,null,null,null,"",0,0]
[null,null,12,{"$f":"IF('AS1'!D16=\"\",\"\",'AS1'!D16)","v":""},{"$f":"IF('AS1'!E16=\"\",\"\",'AS1'!E16)","v":""},null,null,null,null,null,null,null,null,null,null,"",0,0]
[null,null,13,{"$f":"IF('AS1'!D17=\"\",\"\",'AS1'!D17)","v":""},{"$f":"IF('AS1'!E17=\"\",\"\",'AS1'!E17)","v":""},null,null,null,null,null,null,null,null,null,null,"",0,0]
[null,null,14,{"$f":"IF('AS1'!D18=\"\",\"\",'AS1'!D18)","v":""},{"$f":"IF('AS1'!E18=\"\",\"\",'AS1'!E18)","v":""},null,null,null,null,null,null,null,null,null,null,"",0,0]
[null,null,15,{"$f":"IF('AS1'!D19=\"\",\"\",'AS1'!D19)","v":""},{"$f":"IF('AS1'!E19=\"\",\"\",'AS1'!E19)","v":""},null,null,null,null,null,null,null,null,null,null,"",0,0]
[null,null,16,{"$f":"IF('AS1'!D20=\"\",\"\",'AS1'!D20)","v":""},{"$f":"IF('AS1'!E20=\"\",\"\",'AS1'!E20)","v":""},null,null,null,null,null,null,null,null,null,null,"",0,0]
[null,null,17,{"$f":"IF('AS1'!D21=\"\",\"\",'AS1'!D21)","v":""},{"$f":"IF('AS1'!E21=\"\",\"\",'AS1'!E21)","v":""},null,null,null,null,null,null,null,null,null,null,"",0,0]
[null,null,18,{"$f":"IF('AS1'!D22=\"\",\"\",'AS1'!D22)","v":""},{"$f":"IF('AS1'!E22=\"\",\"\",'AS1'!E22)","v":""},null,null,null,null,null,null,null,null,null,null,"",0,0]
[null,null,19,{"$f":"IF('AS1'!D23=\"\",\"\",'AS1'!D23)","v":""},{"$f":"IF('AS1'!E23=\"\",\"\",'AS1'!E23)","v":""},null,null,null,null,null,null,null,null,null,null,"",0,0]
[null,null,20,{"$f":"IF('AS1'!D24=\"\",\"\",'AS1'!D24)","v":""},{"$f":"IF('AS1'!E24=\"\",\"\",'AS1'!E24)","v":""},null,null,null,null,null,null,null,null,null,null,"",0,0]
[null,null,21,{"$f":"IF('AS1'!D25=\"\",\"\",'AS1'!D25)","v":""},{"$f":"IF('AS1'!E25=\"\",\"\",'AS1'!E25)","v":""},null,null,null,null,null,null,null,null,null,null,"",0,0]
[null,null,22,{"$f":"IF('AS1'!D26=\"\",\"\",'AS1'!D26)","v":""},{"$f":"IF('AS1'!E26=\"\",\"\",'AS1'!E26)","v":""},null,null,null,null,null,null,null,null,null,null,"",0,0]
[null,null,23,{"$f":"IF('AS1'!D27=\"\",\"\",'AS1'!D27)","v":""},{"$f":"IF('AS1'!E27=\"\",\"\",'AS1'!E27)","v":""},null,null,null,null,null,null,null,null,null,null,"",0,0]
[null,null,24,{"$f":"IF('AS1'!D28=\"\",\"\",'AS1'!D28)","v":""},{"$f":"IF('AS1'!E28=\"\",\"\",'AS1'!E28)","v":""},null,null,null,null,null,null,null,null,null,null,"",0,0]
[null,null,25,{"$f":"IF('AS1'!D29=\"\",\"\",'AS1'!D29)","v":""},{"$f":"IF('AS1'!E29=\"\",\"\",'AS1'!E29)","v":""},null,null,null,null,null,null,null,null,null,null,"",0,0]
[null,null,26,{"$f":"IF('AS1'!D30=\"\",\"\",'AS1'!D30)","v":""},{"$f":"IF('AS1'!E30=\"\",\"\",'AS1'!E30)","v":""},null,null,null,null,null,null,null,null,null,null,"",0,0]
[null,null,27,{"$f":"IF('AS1'!D31=\"\",\"\",'AS1'!D31)","v":""},{"$f":"IF('AS1'!E31=\"\",\"\",'AS1'!E31)","v":""},null,null,null,null,null,null,null,null,null,null,"",0,0]
[null,null,28,{"$f":"IF('AS1'!D32=\"\",\"\",'AS1'!D32)","v":""},{"$f":"IF('AS1'!E32=\"\",\"\",'AS1'!E32)","v":""},null,null,null,null,null,null,null,null,null,null,"",0,0]
[null,null,29,{"$f":"IF('AS1'!D33=\"\",\"\",'AS1'!D33)","v":""},{"$f":"IF('AS1'!E33=\"\",\"\",'AS1'!E33)","v":""},null,null,null,null,null,null,null,null,null,null,"",0,0]
[null,null,30,{"$f":"IF('AS1'!D34=\"\",\"\",'AS1'!D34)","v":""},{"$f":"IF('AS1'!E34=\"\",\"\",'AS1'!E34)","v":""},null,null,null,null,null,null,null,null,null,null,"",0,0]
[null,null,31,{"$f":"IF('AS1'!D35=\"\",\"\",'AS1'!D35)","v":""},{"$f":"IF('AS1'!E35=\"\",\"\",'AS1'!E35)","v":""},null,null,null,null,null,null,null,null,null,null,"",0,0]
[null,null,32,{"$f":"IF('AS1'!D36=\"\",\"\",'AS1'!D36)","v":""},{"$f":"IF('AS1'!E36=\"\",\"\",'AS1'!E36)","v":""},null,null,null,null,null,null,null,null,null,null,"",0,0]
[null,null,33,{"$f":"IF('AS1'!D37=\"\",\"\",'AS1'!D37)","v":""},{"$f":"IF('AS1'!E37=\"\",\"\",'AS1'!E37)","v":""},null,null,null,null,null,null,null,null,null,null,{"$f":"IF(COUNT(F38:O38)=0,\"\",SUM(F38:O38))","v":""},{"$f":"IF(COUNT(F38:O38)=0,0,ROUND(P38/COUNT(F38:O38),2))","v":0},0]
[null,null,34,{"$f":"IF('AS1'!D38=\"\",\"\",'AS1'!D38)","v":""},{"$f":"IF('AS1'!E38=\"\",\"\",'AS1'!E38)","v":""},null,null,null,null,null,null,null,null,null,null,"",0,0]
[null,null,35,{"$f":"IF('AS1'!D39=\"\",\"\",'AS1'!D39)","v":""},{"$f":"IF('AS1'!E39=\"\",\"\",'AS1'!E39)","v":""},null,null,null,null,null,null,null,null,null,null,"",0,0]
[null,null,36,{"$f":"IF('AS1'!D40=\"\",\"\",'AS1'!D40)","v":""},{"$f":"IF('AS1'!E40=\"\",\"\",'AS1'!E40)","v":""},null,null,null,null,null,null,null,null,null,null,"",0,0]
[null,null,37,{"$f":"IF('AS1'!D41=\"\",\"\",'AS1'!D41)","v":""},{"$f":"IF('AS1'!E41=\"\",\"\",'AS1'!E41)","v":""},null,null,null,null,null,null,null,null,null,null,"",0,0]
[null,null,38,{"$f":"IF('AS1'!D42=\"\",\"\",'AS1'!D42)","v":""},{"$f":"IF('AS1'!E42=\"\",\"\",'AS1'!E42)","v":""},null,null,null,null,null,null,null,null,null,null,"",0,0]
[null,null,39,{"$f":"IF('AS1'!D43=\"\",\"\",'AS1'!D43)","v":""},{"$f":"IF('AS1'!E43=\"\",\"\",'AS1'!E43)","v":""},null,null,null,null,null,null,null,null,null,null,"",0,0]
[null,null,40,{"$f":"IF('AS1'!D44=\"\",\"\",'AS1'!D44)","v":""},{"$f":"IF('AS1'!E44=\"\",\"\",'AS1'!E44)","v":""},null,null,null,null,null,null,null,null,null,null,"",0,0]
[null,null,41,{"$f":"IF('AS1'!D45=\"\",\"\",'AS1'!D45)","v":""},{"$f":"IF('AS1'!E45=\"\",\"\",'AS1'!E45)","v":""},null,null,null,null,null,null,null,null,null,null,"",0,0]
[null,null,42,{"$f":"IF('AS1'!D46=\"\",\"\",'AS1'!D46)","v":""},{"$f":"IF('AS1'!E46=\"\",\"\",'AS1'!E46)","v":""},null,null,null,null,null,null,null,null,null,null,"",0,0]
[null,null,43,{"$f":"IF('AS1'!D47=\"\",\"\",'AS1'!D47)","v":""},{"$f":"IF('AS1'!E47=\"\",\"\",'AS1'!E47)","v":""},null,null,null,null,null,null,null,null,null,null,"",0,0]
[null,null,44,{"$f":"IF('AS1'!D48=\"\",\"\",'AS1'!D48)","v":""},{"$f":"IF('AS1'!E48=\"\",\"\",'AS1'!E48)","v":""},null,null,null,null,null,null,null,null,null,null,"",0,0]
[null,null,45,{"$f":"IF('AS1'!D49=\"\",\"\",'AS1'!D49)","v":""},{"$f":"IF('AS1'!E49=\"\",\"\",'AS1'!E49)","v":""},null,null,null,null,null,null,null,null,null,null,"",0,0]
[null,null,46,{"$f":"IF('AS1'!D50=\"\",\"\",'AS1'!D50)","v":""},{"$f":"IF('AS1'!E50=\"\",\"\",'AS1'!E50)","v":""},null,null,null,null,null,null,null,null,null,null,"",0,0]
[null,null,47,{"$f":"IF('AS1'!D51=\"\",\"\",'AS1'!D51)","v":""},{"$f":"IF('AS1'!E51=\"\",\"\",'AS1'!E51)","v":""},null,null,null,null,null,null,null,null,null,null,"",0,0]
[null,null,48,{"$f":"IF('AS1'!D52=\"\",\"\",'AS1'!D52)","v":""},{"$f":"IF('AS1'!E52=\"\",\"\",'AS1'!E52)","v":""},null,null,null,null,null,null,null,null,null,null,"",0,0]
[null,null,49,{"$f":"IF('AS1'!D53=\"\",\"\",'AS1'!D53)","v":""},{"$f":"IF('AS1'!E53=\"\",\"\",'AS1'!E53)","v":""},null,null,null,null,null,null,null,null,null,null,"",0,0]
[null,null,50,{"$f":"IF('AS1'!D54=\"\",\"\",'AS1'!D54)","v":""},{"$f":"IF('AS1'!E54=\"\",\"\",'AS1'!E54)","v":""},null,null,null,null,null,null,null,null,null,null,"",0,0]
[null,null,51,{"$f":"IF('AS1'!D55=\"\",\"\",'AS1'!D55)","v":""},{"$f":"IF('AS1'!E55=\"\",\"\",'AS1'!E55)","v":""},null,null,null,null,null,null,null,null,null,null,"",0,0]
[null,null,52,{"$f":"IF('AS1'!D56=\"\",\"\",'AS1'!D56)","v":""},{"$f":"IF('AS1'!E56=\"\",\"\",'AS1'!E56)","v":""},null,null,null,null,null,null,null,null,null,null,"",0,0]
[null,null,53,{"$f":"IF('AS1'!D57=\"\",\"\",'AS1'!D57)","v":""},{"$f":"IF('AS1'!E57=\"\",\"\",'AS1'!E57)","v":""},null,null,null,null,null,null,null,null,null,null,"",0,0]
[null,null,54,{"$f":"IF('AS1'!D58=\"\",\"\",'AS1'!D58)","v":""},{"$f":"IF('AS1'!E58=\"\",\"\",'AS1'!E58)","v":""},null,null,null,null,null,null,null,null,null,null,"",0,0]
[null,null,55,{"$f":"IF('AS1'!D59=\"\",\"\",'AS1'!D59)","v":""},{"$f":"IF('AS1'!E59=\"\",\"\",'AS1'!E59)","v":""},null,null,null,null,null,null,null,null,null,null,"",0,0]
[null,null,56,{"$f":"IF('AS1'!D60=\"\",\"\",'AS1'!D60)","v":""},{"$f":"IF('AS1'!E60=\"\",\"\",'AS1'!E60)","v":""},null,null,null,null,null,null,null,null,null,null,"",0,0]
[null,null,57,{"$f":"IF('AS1'!D61=\"\",\"\",'AS1'!D61)","v":""},{"$f":"IF('AS1'!E61=\"\",\"\",'AS1'!E61)","v":""},null,null,null,null,null,null,null,null,null,null,"",0,0]
[null,null,58,{"$f":"IF('AS1'!D62=\"\",\"\",'AS1'!D62)","v":""},{"$f":"IF('AS1'!E62=\"\",\"\",'AS1'!E62)","v":""},null,null,null,null,null,null,null,null,null,null,"",0,0]
[null,null,59,{"$f":"IF('AS1'!D63=\"\",\"\",'AS1'!D63)","v":""},{"$f":"IF('AS1'!E63=\"\",\"\",'AS1'!E63)","v":""},null,null,null,null,null,null,null,null,null,null,"",0,0]
[null,null,60,{"$f":"IF('AS1'!D64=\"\",\"\",'AS1'!D64)","v":""},{"$f":"IF('AS1'!E64=\"\",\"\",'AS1'!E64)","v":""},null,null,null,null,null,null,null,null,null,null,"",0,0]
[null,null,61,{"$f":"IF('AS1'!D65=\"\",\"\",'AS1'!D65)","v":""},{"$f":"IF('AS1'!E65=\"\",\"\",'AS1'!E65)","v":""},null,null,null,null,null,null,null,null,null,null,"",0,0]
[null,null,62,{"$f":"IF('AS1'!D66=\"\",\"\",'AS1'!D66)","v":""},{"$f":"IF('AS1'!E66=\"\",\"\",'AS1'!E66)","v":""},null,null,null,null,null,null,null,null,null,null,"",0,0]
[null,null,63,{"$f":"IF('AS1'!D67=\"\",\"\",'AS1'!D67)","v":""},{"$f":"IF('AS1'!E67=\"\",\"\",'AS1'!E67)","v":""},null,null,null,null,null,null,null,null,null,null,"",0,0]
[null,null,64,{"$f":"IF('AS1'!D68=\"\",\"\",'AS1'!D68)","v":""},{"$f":"IF('AS1'!E68=\"\",\"\",'AS1'!E68)","v":""},null,null,null,null,null,null,null,null,null,null,"",0,0]
[null,null,65,{"$f":"IF('AS1'!D69=\"\",\"\",'AS1'!D69)","v":""},{"$f":"IF('AS1'!E69=\"\",\"\",'AS1'!E69)","v":""},null,null,null,null,null,null,null,null,null,null,{"$f":"IF(COUNT(F70:O70)=0,\"\",SUM(F70:O70))","v":""},{"$f":"IF(COUNT(F70:O70)=0,0,ROUND(P70/COUNT(F70:O70),2))","v":0},0]
[null,null,66,{"$f":"IF('AS1'!D70=\"\",\"\",'AS1'!D70)","v":""},{"$f":"IF('AS1'!E70=\"\",\"\",'AS1'!E70)","v":""},null,null,null,null,null,null,null,null,null,null,"",0,0]
[null,null,67,{"$f":"IF('AS1'!D71=\"\",\"\",'AS1'!D71)","v":""},{"$f":"IF('AS1'!E71=\"\",\"\",'AS1'!E71)","v":""},null,null,null,null,null,null,null,null,null,null,"",0,{"$f":"(Q72*3.5)/10","v":0}]
[null,null,68,{"$f":"IF('AS1'!D72=\"\",\"\",'AS1'!D72)","v":""},{"$f":"IF('AS1'!E72=\"\",\"\",'AS1'!E72)","v":""},null,null,null,null,null,null,null,null,null,null,"",0,0]
[null,null,69,{"$f":"IF('AS1'!D73=\"\",\"\",'AS1'!D73)","v":""},{"$f":"IF('AS1'!E73=\"\",\"\",'AS1'!E73)","v":""},null,null,null,null,null,null,null,null,null,null,"",0,0]
[null,null,70,{"$f":"IF('AS1'!D74=\"\",\"\",'AS1'!D74)","v":""},{"$f":"IF('AS1'!E74=\"\",\"\",'AS1'!E74)","v":""},null,null,null,null,null,null,null,null,null,null,"",0,0]

{"sheet":"AUT1","index":4,"n_rows":75,"n_cols":18,"rows_kept":75,"cut":false,"hidden":false,"merged":[[3,17,4,17],[1,2,1,17],[2,2,2,17],[3,2,4,2],[3,3,4,3],[3,4,4,4],[3,15,4,15],[3,16,4,16]]}
[]
[null,null,"ACTIVIDADES DE APRENDIZAJE AUTÓNOMO: Aprendizaje independiente e individual del estudiante - PRIMER PARCIAL"]
[null,null,"Lectura, análisis y compresión de materiales bibliográficos y documentales tanto analógicos como digitales, generación de datos y búsqueda de información, elaboración individual de  ensayos, trabajos y exposiciones."]
[null,null,"N","NRO DE CÉDULA","NOMINA",1,2,3,4,5,6,7,8,9,10,"suma","PROMEDIO sobre 10","EQUIVALENCIA sobre 3"]
[null,null,null,null,null,"EXPOSICIÓN Proceso del parto 15-17-24/10/24 Monitorización de la FCF Variaciones   de la FCF 22/10/24"]
[null,null,1,{"$f":"IF('AS1'!D5=\"\",\"\",'AS1'!D5)","v":""},{"$f":"IF('AS1'!E5=\"\",\"\",'AS1'!E5)","v":"DAQUILEMA LONDO SHIRLEY ESTEFAFANÍA"},9.4,null,null,null,null,null,null,null,null,null,{"$f":"IF(COUNT(F6:O6)=0,\"\",SUM(F6:O6))","v":9.4},{"$f":"IF(COUNT(F6:O6)=0,0,ROUND(P6/COUNT(F6:O6),2))","v":9.4},{"$f":"(Q6*3)/10","v":2.8200000000000003}]
[null,null,2,{"$f":"IF('AS1'!D6=\"\",\"\",'AS1'!D6)","v":""},{"$f":"IF('AS1'!E6=\"\",\"\",'AS1'!E6)","v":"GOYES ORTIZ NATASHA DAYANA"},9.1999999999999993,null,null,null,null,null,null,null,null,null,9.1999999999999993,9.1999999999999993,{"$f":"(Q7*3)/10","v":2.76}]
[null,null,3,{"$f":"IF('AS1'!D7=\"\",\"\",'AS1'!D7)","v":""},{"$f":"IF('AS1'!E7=\"\",\"\",'AS1'!E7)","v":"GUADALUPE RUIZ YULISA NATALY"},7.8,null,null,null,null,null,null,null,null,null,7.8,7.8,{"$f":"(Q8*3)/10","v":2.34}]
[null,null,4,{"$f":"IF('AS1'!D8=\"\",\"\",'AS1'!D8)","v":""},{"$f":"IF('AS1'!E8=\"\",\"\",'AS1'!E8)","v":"MELO CHAVEZ KEVIN JOSUE"},9,null,null,null,null,null,null,null,null,null,9,9,{"$f":"(Q9*3)/10","v":2.7}]
[null,null,5,{"$f":"IF('AS1'!D9=\"\",\"\",'AS1'!D9)","v":""},{"$f":"IF('AS1'!E9=\"\",\"\",'AS1'!E9)","v":"MULLO PAUCAR ADRIANA ANABEL"},7.4,null,null,null,null,null,null,null,null,null,7.4,7.4,2.2200000000000002]
[null,null,6,{"$f":"IF('AS1'!D10=\"\",\"\",'AS1'!D10)","v":""},{"$f":"IF('AS1'!E10=\"\",\"\",'AS1'!E10)","v":"NARANJO PALACIOS FERNANDA BRIGUITTE"},6.2,null,null,null,null,null,null,null,null,null,6.2,6.2,1.86]
[null,null,7,{"$f":"IF('AS1'!D11=\"\",\"\",'AS1'!D11)","v":""},{"$f":"IF('AS1'!E11=\"\",\"\",'AS1'!E11)","v":"SOTO VARGAS ERIKA SAMANTA"},6.4,null,null,null,null,null,null,null,null,null,6.4,6.4,1.9200000000000004]
[null,null,8,{"$f":"IF('AS1'!D12=\"\",\"\",'AS1'!D12)","v":""},{"$f":"IF('AS1'!E12=\"\",\"\",'AS1'!E12)","v":"VALLEJO ORDOÑEZ SAYONARA ELIZABETH"},6.2,null,null,null,null,null,null,null,null,null,6.2,6.2,1.86]
[null,null,9,{"$f":"IF('AS1'!D13=\"\",\"\",'AS1'!D13)","v":""},{"$f":"IF('AS1'!E13=\"\",\"\",'AS1'!E13)","v":""},null,null,null,null,null,null,null,null,null,null,"",0,0]
[null,null,10,{"$f":"IF('AS1'!D14=\"\",\"\",'AS1'!D14)","v":""},{"$f":"IF('AS1'!E14=\"\",\"\",'AS1'!E14)","v":""},null,null,null,null,null,null,null,null,null,null,"",0,0]
[null,null,11,{"$f":"IF('AS1'!D15=\"\",\"\",'AS1'!D15)","v":""},{"$f":"IF('AS1'!E15=\"\",\"\",'AS1'!E15)","v":""},null,null,null,null,null,null,null,null,null,null,"",0,0]
[null,null,12,{"$f":"IF('AS1'!D16=\"\",\"\",'AS1'!D16)","v":""},{"$f":"IF('AS1'!E16=\"\",\"\",'AS1'!E16)","v":""},null,null,null,null,null,null,null,null,null,null,"",0,0]
[null,null,13,{"$f":"IF('AS1'!D17=\"\",\"\",'AS1'!D17)","v":""},{"$f":"IF('AS1'!E17=\"\",\"\",'AS1'!E17)","v":""},null,null,null,null,null,null,null,null,null,null,"",0,0]
[null,null,14,{"$f":"IF('AS1'!D18=\"\",\"\",'AS1'!D18)","v":""},{"$f":"IF('AS1'!E18=\"\",\"\",'AS1'!E18)","v":""},null,null,null,null,null,null,null,null,null,null,"",0,0]
[null,null,15,{"$f":"IF('AS1'!D19=\"\",\"\",'AS1'!D19)","v":""},{"$f":"IF('AS1'!E19=\"\",\"\",'AS1'!E19)","v":""},null,null,null,null,null,null,null,null,null,null,"",0,0]
[null,null,16,{"$f":"IF('AS1'!D20=\"\",\"\",'AS1'!D20)","v":""},{"$f":"IF('AS1'!E20=\"\",\"\",'AS1'!E20)","v":""},null,null,null,null,null,null,null,null,null,null,"",0,0]
[null,null,17,{"$f":"IF('AS1'!D21=\"\",\"\",'AS1'!D21)","v":""},{"$f":"IF('AS1'!E21=\"\",\"\",'AS1'!E21)","v":""},null,null,null,null,null,null,null,null,null,null,"",0,0]
[null,null,18,{"$f":"IF('AS1'!D22=\"\",\"\",'AS1'!D22)","v":""},{"$f":"IF('AS1'!E22=\"\",\"\",'AS1'!E22)","v":""},null,null,null,null,null,null,null,null,null,null,"",0,0]
[null,null,19,{"$f":"IF('AS1'!D23=\"\",\"\",'AS1'!D23)","v":""},{"$f":"IF('AS1'!E23=\"\",\"\",'AS1'!E23)","v":""},null,null,null,null,null,null,null,null,null,null,"",0,0]
[null,null,20,{"$f":"IF('AS1'!D24=\"\",\"\",'AS1'!D24)","v":""},{"$f":"IF('AS1'!E24=\"\",\"\",'AS1'!E24)","v":""},null,null,null,null,null,null,null,null,null,null,"",0,0]
[null,null,21,{"$f":"IF('AS1'!D25=\"\",\"\",'AS1'!D25)","v":""},{"$f":"IF('AS1'!E25=\"\",\"\",'AS1'!E25)","v":""},null,null,null,null,null,null,null,null,null,null,"",0,0]
[null,null,22,{"$f":"IF('AS1'!D26=\"\",\"\",'AS1'!D26)","v":""},{"$f":"IF('AS1'!E26=\"\",\"\",'AS1'!E26)","v":""},null,null,null,null,null,null,null,null,null,null,"",0,0]
[null,null,23,{"$f":"IF('AS1'!D27=\"\",\"\",'AS1'!D27)","v":""},{"$f":"IF('AS1'!E27=\"\",\"\",'AS1'!E27)","v":""},10,null,null,null,null,null,null,null,null,null,10,10,3]
[null,null,24,{"$f":"IF('AS1'!D28=\"\",\"\",'AS1'!D28)","v":""},{"$f":"IF('AS1'!E28=\"\",\"\",'AS1'!E28)","v":""},null,null,null,null,null,null,null,null,null,null,"",0,0]
[null,null,25,{"$f":"IF('AS1'!D29=\"\",\"\",'AS1'!D29)","v":""},{"$f":"IF('AS1'!E29=\"\",\"\",'AS1'!E29)","v":""},null,null,null,null,null,null,null,null,null,null,"",0,0]
[null,null,26,{"$f":"IF('AS1'!D30=\"\",\"\",'AS1'!D30)","v":""},{"$f":"IF('AS1'!E30=\"\",\"\",'AS1'!E30)","v":""},null,null,null,null,null,null,null,null,null,null,"",0,0]
[null,null,27,{"$f":"IF('AS1'!D31=\"\",\"\",'AS1'!D31)","v":""},{"$f":"IF('AS1'!E31=\"\",\"\",'AS1'!E31)","v":""},null,null,null,null,null,null,null,null,null,null,"",0,0]
[null,null,28,{"$f":"IF('AS1'!D32=\"\",\"\",'AS1'!D32)","v":""},{"$f":"IF('AS1'!E32=\"\",\"\",'AS1'!E32)","v":""},null,null,null,null,null,null,null,null,null,null,"",0,0]
[null,null,29,{"$f":"IF('AS1'!D33=\"\",\"\",'AS1'!D33)","v":""},{"$f":"IF('AS1'!E33=\"\",\"\",'AS1'!E33)","v":""},null,null,null,null,null,null,null,null,null,null,"",0,0]
[null,null,30,{"$f":"IF('AS1'!D34=\"\",\"\",'AS1'!D34)","v":""},{"$f":"IF('AS1'!E34=\"\",\"\",'AS1'!E34)","v":""},null,null,null,null,null,null,null,null,null,null,"",0,0]
[null,null,31,{"$f":"IF('AS1'!D35=\"\",\"\",'AS1'!D35)","v":""},{"$f":"IF('AS1'!E35=\"\",\"\",'AS1'!E35)","v":""},null,null,null,null,null,null,null,null,null,null,"",0,0]
[null,null,32,{"$f":"IF('AS1'!D36=\"\",\"\",'AS1'!D36)","v":""},{"$f":"IF('AS1'!E36=\"\",\"\",'AS1'!E36)","v":""},null,null,null,null,null,null,null,null,null,null,"",0,0]
[null,null,33,{"$f":"IF('AS1'!D37=\"\",\"\",'AS1'!D37)","v":""},{"$f":"IF('AS1'!E37=\"\",\"\",'AS1'!E37)","v":""},null,null,null,null,null,null,null,null,null,null,{"$f":"IF(COUNT(F38:O38)=0,\"\",SUM(F38:O38))","v":""},{"$f":"IF(COUNT(F38:O38)=0,0,ROUND(P38/COUNT(F38:O38),2))","v":0},0]
[null,null,34,{"$f":"IF('AS1'!D38=\"\",\"\",'AS1'!D38)","v":""},{"$f":"IF('AS1'!E38=\"\",\"\",'AS1'!E38)","v":""},null,null,null,null,null,null,null,null,null,null,"",0,0]
[null,null,35,{"$f":"IF('AS1'!D39=\"\",\"\",'AS1'!D39)","v":""},{"$f":"IF('AS1'!E39=\"\",\"\",'AS1'!E39)","v":""},null,null,null,null,null,null,null,null,null,null,"",0,0]
[null,null,36,{"$f":"IF('AS1'!D40=\"\",\"\",'AS1'!D40)","v":""},{"$f":"IF('AS1'!E40=\"\",\"\",'AS1'!E40)","v":""},null,null,null,null,null,null,null,null,null,null,"",0,0]
[null,null,37,{"$f":"IF('AS1'!D41=\"\",\"\",'AS1'!D41)","v":""},{"$f":"IF('AS1'!E41=\"\",\"\",'AS1'!E41)","v":""},null,null,null,null,null,null,null,null,null,null,"",0,0]
[null,null,38,{"$f":"IF('AS1'!D42=\"\",\"\",'AS1'!D42)","v":""},{"$f":"IF('AS1'!E42=\"\",\"\",'AS1'!E42)","v":""},null,null,null,null,null,null,null,null,null,null,"",0,0]
[null,null,39,{"$f":"IF('AS1'!D43=\"\",\"\",'AS1'!D43)","v":""},{"$f":"IF('AS1'!E43=\"\",\"\",'AS1'!E43)","v":""},null,null,null,null,null,null,null,null,null,null,"",0,0]
[null,null,40,{"$f":"IF('AS1'!D44=\"\",\"\",'AS1'!D44)","v":""},{"$f":"IF('AS1'!E44=\"\",\"\",'AS1'!E44)","v":""},null,null,null,null,null,null,null,null,null,null,"",0,0]
[null,null,41,{"$f":"IF('AS1'!D45=\"\",\"\",'AS1'!D45)","v":""},{"$f":"IF('AS1'!E45=\"\",\"\",'AS1'!E45)","v":""},null,null,null,null,null,null,null,null,null,null,"",0,0]
[null,null,42,{"$f":"IF('AS1'!D46=\"\",\"\",'AS1'!D46)","v":""},{"$f":"IF('AS1'!E46=\"\",\"\",'AS1'!E46)","v":""},null,null,null,null,null,null,null,null,null,null,"",0,0]
[null,null,43,{"$f":"IF('AS1'!D47=\"\",\"\",'AS1'!D47)","v":""},{"$f":"IF('AS1'!E47=\"\",\"\",'AS1'!E47)","v":""},null,null,null,null,null,null,null,null,null,null,"",0,0]
[null,null,44,{"$f":"IF('AS1'!D48=\"\",\"\",'AS1'!D48)","v":""},{"$f":"IF('AS1'!E48=\"\",\"\",'AS1'!E48)","v":""},null,null,null,null,null,null,null,null,null,null,"",0,0]
[null,null,45,{"$f":"IF('AS1'!D49=\"\",\"\",'AS1'!D49)","v":""},{"$f":"IF('AS1'!E49=\"\",\"\",'AS1'!E49)","v":""},null,null,null,null,null,null,null,null,null,null,"",0,0]
[null,null,46,{"$f":"IF('AS1'!D50=\"\",\"\",'AS1'!D50)","v":""},{"$f":"IF('AS1'!E50=\"\",\"\",'AS1'!E50)","v":""},null,null,null,null,null,null,null,null,null,null,"",0,0]
[null,null,47,{"$f":"IF('AS1'!D51=\"\",\"\",'AS1'!D51)","v":""},{"$f":"IF('AS1'!E51=\"\",\"\",'AS1'!E51)","v":""},null,null,null,null,null,null,null,null,null,null,"",0,0]
[null,null,48,{"$f":"IF('AS1'!D52=\"\",\"\",'AS1'!D52)","v":""},{"$f":"IF('AS1'!E52=\"\",\"\",'AS1'!E52)","v":""},null,null,null,null,null,null,null,null,null,null,"",0,0]
[null,null,49,{"$f":"IF('AS1'!D53=\"\",\"\",'AS1'!D53)","v":""},{"$f":"IF('AS1'!E53=\"\",\"\",'AS1'!E53)","v":""},null,null,null,null,null,null,null,null,null,null,"",0,0]
[null,null,50,{"$f":"IF('AS1'!D54=\"\",\"\",'AS1'!D54)","v":""},{"$f":"IF('AS1'!E54=\"\",\"\",'AS1'!E54)","v":""},null,null,null,null,null,null,null,null,null,null,"",0,0]
[null,null,51,{"$f":"IF('AS1'!D55=\"\",\"\",'AS1'!D55)","v":""},{"$f":"IF('AS1'!E55=\"\",\"\",'AS1'!E55)","v":""},null,null,null,null,null,null,null,null,null,null,"",0,0]
[null,null,52,{"$f":"IF('AS1'!D56=\"\",\"\",'AS1'!D56)","v":""},{"$f":"IF('AS1'!E56=\"\",\"\",'AS1'!E56)","v":""},null,null,null,null,null,null,null,null,null,null,"",0,0]
[null,null,53,{"$f":"IF('AS1'!D57=\"\",\"\",'AS1'!D57)","v":""},{"$f":"IF('AS1'!E57=\"\",\"\",'AS1'!E57)","v":""},null,null,null,null,null,null,null,null,null,null,"",0,0]
[null,null,54,{"$f":"IF('AS1'!D58=\"\",\"\",'AS1'!D58)","v":""},{"$f":"IF('AS1'!E58=\"\",\"\",'AS1'!E58)","v":""},null,null,null,null,null,null,null,null,null,null,"",0,0]
[null,null,55,{"$f":"IF('AS1'!D59=\"\",\"\",'AS1'!D59)","v":""},{"$f":"IF('AS1'!E59=\"\",\"\",'AS1'!E59)","v":""},null,null,null,null,null,null,null,null,null,null,"",0,0]
[null,null,56,{"$f":"IF('AS1'!D60=\"\",\"\",'AS1'!D60)","v":""},{"$f":"IF('AS1'!E60=\"\",\"\",'AS1'!E60)","v":""},null,null,null,null,null,null,null,null,null,null,"",0,0]
[null,null,57,{"$f":"IF('AS1'!D61=\"\",\"\",'AS1'!D61)","v":""},{"$f":"IF('AS1'!E61=\"\",\"\",'AS1'!E61)","v":""},null,null,null,null,null,null,null,null,null,null,"",0,0]
[null,null,58,{"$f":"IF('AS1'!D62=\"\",\"\",'AS1'!D62)","v":""},{"$f":"IF('AS1'!E62=\"\",\"\",'AS1'!E62)","v":""},null,null,null,null,null,null,null,null,null,null,"",0,0]
[null,null,59,{"$f":"IF('AS1'!D63=\"\",\"\",'AS1'!D63)","v":""},{"$f":"IF('AS1'!E63=\"\",\"\",'AS1'!E63)","v":""},null,null,null,null,null,null,null,null,null,null,"",0,0]
[null,null,60,{"$f":"IF('AS1'!D64=\"\",\"\",'AS1'!D64)","v":""},{"$f":"IF('AS1'!E64=\"\",\"\",'AS1'!E64)","v":""},null,null,null,null,null,null,null,null,null,null,"",0,0]
[null,null,61,{"$f":"IF('AS1'!D65=\"\",\"\",'AS1'!D65)","v":""},{"$f":"IF('AS1'!E65=\"\",\"\",'AS1'!E65)","v":""},null,null,null,null,null,null,null,null,null,null,"",0,0]
[null,null,62,{"$f":"IF('AS1'!D66=\"\",\"\",'AS1'!D66)","v":""},{"$f":"IF('AS1'!E66=\"\",\"\",'AS1'!E66)","v":""},null,null,null,null,null,null,null,null,null,null,"",0,0]
[null,null,63,{"$f":"IF('AS1'!D67=\"\",\"\",'AS1'!D67)","v":""},{"$f":"IF('AS1'!E67=\"\",\"\",'AS1'!E67)","v":""},null,null,null,null,null,null,null,null,null,null,"",0,0]
[null,null,64,{"$f":"IF('AS1'!D68=\"\",\"\",'AS1'!D68)","v":""},{"$f":"IF('AS1'!E68=\"\",\"\",'AS1'!E68)","v":""},null,null,null,null,null,null,null,null,null,null,"",0,0]
[null,null,65,{"$f":"IF('AS1'!D69=\"\",\"\",'AS1'!D69)","v":""},{"$f":"IF('AS1'!E69=\"\",\"\",'AS1'!E69)","v":""},null,null,null,null,null,null,null,null,null,null,{"$f":"IF(COUNT(F70:O70)=0,\"\",SUM(F70:O70))","v":""},{"$f":"IF(COUNT(F70:O70)=0,0,ROUND(P70/COUNT(F70:O70),2))","v":0},0]
[null,null,66,{"$f":"IF('AS1'!D70=\"\",\"\",'AS1'!D70)","v":""},{"$f":"IF('AS1'!E70=\"\",\"\",'AS1'!E70)","v":""},null,null,null,null,null,null,null,null,null,null,"",0,0]
[null,null,67,{"$f":"IF('AS1'!D71=\"\",\"\",'AS1'!D71)","v":""},{"$f":"IF('AS1'!E71=\"\",\"\",'AS1'!E71)","v":""},null,null,null,null,null,null,null,null,null,null,"",0,0]
[null,null,68,{"$f":"IF('AS1'!D72=\"\",\"\",'AS1'!D72)","v":""},{"$f":"IF('AS1'!E72=\"\",\"\",'AS1'!E72)","v":""},null,null,null,null,null,null,null,null,null,null,"",0,{"$f":"(Q73*3)/10","v":0}]
[null,null,69,{"$f":"IF('AS1'!D73=\"\",\"\",'AS1'!D73)","v":""},{"$f":"IF('AS1'!E73=\"\",\"\",'AS1'!E73)","v":""},null,null,null,null,null,null,null,null,null,null,"",0,0]
[null,null,70,{"$f":"IF('AS1'!D74=\"\",\"\",'AS1'!D74)","v":""},{"$f":"IF('AS1'!E74=\"\",\"\",'AS1'!E74)","v":""},null,null,null,null,null,null,null,null,null,null,"",0,{"$f":"(Q75*3)/10","v":0}]

{"sheet":"PARCIAL1","index":5,"n_rows":82,"n_cols":12,"rows_kept":82,"cut":false,"hidden":false,"merged":[[9,2,9,4],[10,4,11,4],[10,3,11,3],[10,2,11,2],[6,2,6,8],[8,2,8,11],[7,2,7,5],[9,10,9,11],[10,5,11,5],[10,6,11,6],[10,10,11,10],[10,11,11,11],[9,5,9,6],[9,7,9,9],[7,8,7,10],[1,2,1,11],[2,2,2,11],[4,2,4,11],[5,9,5,11],[6,9,6,11],[3,2,3,11],[5,2,5,8]]}
[]
[null,null,"UNIVERSIDAD NACIONAL DE CHIMBORAZO"]
[null,null,{"$f":"CONCATENATE(\"FACULTAD DE \",INICIO!D5)","v":"FACULTAD DE Ciencias de la Salud"}]
[null,null,{"$f":"CONCATENATE(\"CARRERA DE \",INICIO!D6)","v":"CARRERA DE Enfermería"}]
[null,null,"ACTA DE CALIFICACIONES DEL PRIMER PARCIAL"]
[null,null,{"$f":"CONCATENATE(\"SEMESTRE: \",INICIO!D8)","v":"SEMESTRE: 6to"},null,null,null,null,null,null,{"$f":"CONCATENATE(\"ASIGNATURA: \",INICIO!D11)","v":"ASIGNATURA: Enfermería Gíneco oObstétrica II"}]
[null,null,{"$f":"CONCATENATE(\"PARALELO: \",INICIO!D9)","v":"PARALELO: A"},null,null,null,null,null,null,{"$f":"CONCATENATE(\"DOCENTE: \",INICIO!D4)","v":"DOCENTE: Graciela Rivera Herrera"}]
[null,null,{"$f":"CONCATENATE(\"PERIODO LECTIVO: \",INICIO!D7)","v":"PERIODO LECTIVO:  2024 -  2025"},null,null,null,null,null,"No. Horas Totales Laboradas:",null,null,{"$f":"'AS1'!BF2","v":52}]
[]
[null,null,null,null,null,"ASISTENCIA",null,"CALIFICACIONES",null,null,"PROMEDIO"]
[null,null,"N","NRO DE CÉDULA","NOMINA","N","%","Aprendizaje\n en contacto\n con el\n docente","Aprendizaje \npráctico experimental","Actividades de Aprendizaje Autónomo","Números","Letras"]
[null,null,null,null,null,null,null,"3,5 PUNTOS","práctico experimenta","3 PUNTOS"]
[null,null,1,{"$f":"IF('AS1'!D5=\"\",\"\",'AS1'!D5)","v":""},{"$f":"IF('AS1'!E5=\"\",\"\",'AS1'!E5)","v":"DAQUILEMA LONDO SHIRLEY ESTEFAFANÍA"},{"$f":"'AS1'!BF5","v":52},{"$f":"IF(L$8=0,0,(F13*100)/L$8)","v":100},{"$f":"'DOC1'!R6","v":2.625},{"$f":"PRAC1!R6","v":2.3905000000000003},{"$f":"'AUT1'!R6","v":2.8200000000000003},{"$f":"ROUND(SUM(H13:J13),2)","v":7.84},{"$f":"VLOOKUP(K13,RESERVADO!A$1:B$1001,2)","v":"SIETE.OCHENTAYCUATRO"}]
[null,null,2,{"$f":"IF('AS1'!D6=\"\",\"\",'AS1'!D6)","v":""},{"$f":"IF('AS1'!E6=\"\",\"\",'AS1'!E6)","v":"GOYES ORTIZ NATASHA DAYANA"},{"$f":"'AS1'!BF6","v":44},84.615384615384613,{"$f":"'DOC1'!R7","v":2.9854999999999996},{"$f":"PRAC1!R7","v":2.7719999999999998},{"$f":"'AUT1'!R7","v":2.76},{"$f":"ROUND(SUM(H14:J14),2)","v":8.52},{"$f":"VLOOKUP(K14,RESERVADO!A$1:B$1001,2)","v":"OCHO.CINCUENTAYDOS"}]
[null,null,3,{"$f":"IF('AS1'!D7=\"\",\"\",'AS1'!D7)","v":""},{"$f":"IF('AS1'!E7=\"\",\"\",'AS1'!E7)","v":"GUADALUPE RUIZ YULISA NATALY"},{"$f":"'AS1'!BF7","v":52},100,{"$f":"'DOC1'!R8","v":2.6704999999999997},{"$f":"PRAC1!R8","v":2.1280000000000001},{"$f":"'AUT1'!R8","v":2.34},{"$f":"ROUND(SUM(H15:J15),2)","v":7.14},{"$f":"VLOOKUP(K15,RESERVADO!A$1:B$1001,2)","v":"SIETE.CATORCE"}]
[null,null,4,{"$f":"IF('AS1'!D8=\"\",\"\",'AS1'!D8)","v":""},{"$f":"IF('AS1'!E8=\"\",\"\",'AS1'!E8)","v":"MELO CHAVEZ KEVIN JOSUE"},{"$f":"'AS1'!BF8","v":54},103.84615384615384,{"$f":"'DOC1'!R9","v":3.0169999999999999},{"$f":"PRAC1!R9","v":2.282},{"$f":"'AUT1'!R9","v":2.7},{"$f":"ROUND(SUM(H16:J16),2)","v":8},{"$f":"VLOOKUP(K16,RESERVADO!A$1:B$1001,2)","v":"OCHO"}]
[null,null,5,{"$f":"IF('AS1'!D9=\"\",\"\",'AS1'!D9)","v":""},{"$f":"IF('AS1'!E9=\"\",\"\",'AS1'!E9)","v":"MULLO PAUCAR ADRIANA ANABEL"},{"$f":"'AS1'!BF9","v":54},103.84615384615384,{"$f":"'DOC1'!R10","v":3.0729999999999995},{"$f":"PRAC1!R10","v":2.4325000000000001},{"$f":"'AUT1'!R10","v":2.2200000000000002},7.73,{"$f":"VLOOKUP(K17,RESERVADO!A$1:B$1001,2)","v":"SIETE.SETENTAYTRES"}]
[null,null,6,{"$f":"IF('AS1'!D10=\"\",\"\",'AS1'!D10)","v":""},{"$f":"IF('AS1'!E10=\"\",\"\",'AS1'!E10)","v":"NARANJO PALACIOS FERNANDA BRIGUITTE"},{"$f":"'AS1'!BF10","v":18},34.615384615384613,{"$f":"'DOC1'!R11","v":0},{"$f":"PRAC1!R11","v":0},{"$f":"'AUT1'!R11","v":1.86},1.86,{"$f":"VLOOKUP(K18,RESERVADO!A$1:B$1001,2)","v":"UNO.OCHENTAYSEIS"}]
[null,null,7,{"$f":"IF('AS1'!D11=\"\",\"\",'AS1'!D11)","v":""},{"$f":"IF('AS1'!E11=\"\",\"\",'AS1'!E11)","v":"SOTO VARGAS ERIKA SAMANTA"},{"$f":"'AS1'!BF11","v":54},103.84615384615384,{"$f":"'DOC1'!R12","v":2.3029999999999999},{"$f":"PRAC1!R12","v":2.4954999999999998},{"$f":"'AUT1'!R12","v":1.9200000000000004},6.72,{"$f":"VLOOKUP(K19,RESERVADO!A$1:B$1001,2)","v":"SEIS.SETENTAYDOS"}]
[null,null,8,{"$f":"IF('AS1'!D12=\"\",\"\",'AS1'!D12)","v":""},{"$f":"IF('AS1'!E12=\"\",\"\",'AS1'!E12)","v":"VALLEJO ORDOÑEZ SAYONARA ELIZABETH"},{"$f":"'AS1'!BF12","v":54},103.84615384615384,{"$f":"'DOC1'!R13","v":2.4394999999999998},{"$f":"PRAC1!R13","v":2.0825},{"$f":"'AUT1'!R13","v":1.86},6.38,{"$f":"VLOOKUP(K20,RESERVADO!A$1:B$1001,2)","v":"SEIS.TREINTAYOCHO"}]
[null,null,9,{"$f":"IF('AS1'!D13=\"\",\"\",'AS1'!D13)","v":""},{"$f":"IF('AS1'!E13=\"\",\"\",'AS1'!E13)","v":""},{"$f":"'AS1'!BF13","v":0},0,{"$f":"'DOC1'!R14","v":0},{"$f":"PRAC1!R14","v":0},{"$f":"'AUT1'!R14","v":0},0,{"$f":"VLOOKUP(K21,RESERVADO!A$1:B$1001,2)","v":"CERO"}]
[null,null,10,{"$f":"IF('AS1'!D14=\"\",\"\",'AS1'!D14)","v":""},{"$f":"IF('AS1'!E14=\"\",\"\",'AS1'!E14)","v":""},{"$f":"'AS1'!BF14","v":0},0,{"$f":"'DOC1'!R15","v":0},{"$f":"PRAC1!R15","v":0},{"$f":"'AUT1'!R15","v":0},0,{"$f":"VLOOKUP(K22,RESERVADO!A$1:B$1001,2)","v":"CERO"}]
[null,null,11,{"$f":"IF('AS1'!D15=\"\",\"\",'AS1'!D15)","v":""},{"$f":"IF('AS1'!E15=\"\",\"\",'AS1'!E15)","v":""},{"$f":"'AS1'!BF15","v":0},0,{"$f":"'DOC1'!R16","v":0},{"$f":"PRAC1!R16","v":0},{"$f":"'AUT1'!R16","v":0},0,{"$f":"VLOOKUP(K23,RESERVADO!A$1:B$1001,2)","v":"CERO"}]
[null,null,12,{"$f":"IF('AS1'!D16=\"\",\"\",'AS1'!D16)","v":""},{"$f":"IF('AS1'!E16=\"\",\"\",'AS1'!E16)","v":""},{"$f":"'AS1'!BF16","v":0},0,{"$f":"'DOC1'!R17","v":0},{"$f":"PRAC1!R17","v":0},{"$f":"'AUT1'!R17","v":0},0,{"$f":"VLOOKUP(K24,RESERVADO!A$1:B$1001,2)","v":"CERO"}]
[null,null,13,{"$f":"IF('AS1'!D17=\"\",\"\",'AS1'!D17)","v":""},{"$f":"IF('AS1'!E17=\"\",\"\",'AS1'!E17)","v":""},{"$f":"'AS1'!BF17","v":0},0,{"$f":"'DOC1'!R18","v":0},{"$f":"PRAC1!R18","v":0},{"$f":"'AUT1'!R18","v":0},0,{"$f":"VLOOKUP(K25,RESERVADO!A$1:B$1001,2)","v":"CERO"}]
[null,null,14,{"$f":"IF('AS1'!D18=\"\",\"\",'AS1'!D18)","v":""},{"$f":"IF('AS1'!E18=\"\",\"\",'AS1'!E18)","v":""},{"$f":"'AS1'!BF18","v":0},0,{"$f":"'DOC1'!R19","v":0},{"$f":"PRAC1!R19","v":0},{"$f":"'AUT1'!R19","v":0},0,{"$f":"VLOOKUP(K26,RESERVADO!A$1:B$1001,2)","v":"CERO"}]
[null,null,15,{"$f":"IF('AS1'!D19=\"\",\"\",'AS1'!D19)","v":""},{"$f":"IF('AS1'!E19=\"\",\"\",'AS1'!E19)","v":""},{"$f":"'AS1'!BF19","v":0},0,{"$f":"'DOC1'!R20","v":0},{"$f":"PRAC1!R20","v":0},{"$f":"'AUT1'!R20","v":0},0,{"$f":"VLOOKUP(K27,RESERVADO!A$1:B$1001,2)","v":"CERO"}]
[null,null,16,{"$f":"IF('AS1'!D20=\"\",\"\",'AS1'!D20)","v":""},{"$f":"IF('AS1'!E20=\"\",\"\",'AS1'!E20)","v":""},{"$f":"'AS1'!BF20","v":0},0,{"$f":"'DOC1'!R21","v":0},{"$f":"PRAC1!R21","v":0},{"$f":"'AUT1'!R21","v":0},0,{"$f":"VLOOKUP(K28,RESERVADO!A$1:B$1001,2)","v":"CERO"}]
[null,null,17,{"$f":"IF('AS1'!D21=\"\",\"\",'AS1'!D21)","v":""},{"$f":"IF('AS1'!E21=\"\",\"\",'AS1'!E21)","v":""},{"$f":"'AS1'!BF21","v":0},0,{"$f":"'DOC1'!R22","v":0},{"$f":"PRAC1!R22","v":0},{"$f":"'AUT1'!R22","v":0},0,{"$f":"VLOOKUP(K29,RESERVADO!A$1:B$1001,2)","v":"CERO"}]
[null,null,18,{"$f":"IF('AS1'!D22=\"\",\"\",'AS1'!D22)","v":""},{"$f":"IF('AS1'!E22=\"\",\"\",'AS1'!E22)","v":""},{"$f":"'AS1'!BF22","v":0},0,{"$f":"'DOC1'!R23","v":0},{"$f":"PRAC1!R23","v":0},{"$f":"'AUT1'!R23","v":0},0,{"$f":"VLOOKUP(K30,RESERVADO!A$1:B$1001,2)","v":"CERO"}]
[null,null,19,{"$f":"IF('AS1'!D23=\"\",\"\",'AS1'!D23)","v":""},{"$f":"IF('AS1'!E23=\"\",\"\",'AS1'!E23)","v":""},{"$f":"'AS1'!BF23","v":0},0,{"$f":"'DOC1'!R24","v":0},{"$f":"PRAC1!R24","v":0},{"$f":"'AUT1'!R24","v":0},0,{"$f":"VLOOKUP(K31,RESERVADO!A$1:B$1001,2)","v":"CERO"}]
[null,null,20,{"$f":"IF('AS1'!D24=\"\",\"\",'AS1'!D24)","v":""},{"$f":"IF('AS1'!E24=\"\",\"\",'AS1'!E24)","v":""},{"$f":"'AS1'!BF24","v":0},0,{"$f":"'DOC1'!R25","v":0},{"$f":"PRAC1!R25","v":0},{"$f":"'AUT1'!R25","v":0},0,{"$f":"VLOOKUP(K32,RESERVADO!A$1:B$1001,2)","v":"CERO"}]
[null,null,21,{"$f":"IF('AS1'!D25=\"\",\"\",'AS1'!D25)","v":""},{"$f":"IF('AS1'!E25=\"\",\"\",'AS1'!E25)","v":""},{"$f":"'AS1'!BF25","v":0},0,{"$f":"'DOC1'!R26","v":0},{"$f":"PRAC1!R26","v":0},{"$f":"'AUT1'!R26","v":0},0,{"$f":"VLOOKUP(K33,RESERVADO!A$1:B$1001,2)","v":"CERO"}]
[null,null,22,{"$f":"IF('AS1'!D26=\"\",\"\",'AS1'!D26)","v":""},{"$f":"IF('AS1'!E26=\"\",\"\",'AS1'!E26)","v":""},{"$f":"'AS1'!BF26","v":0},0,{"$f":"'DOC1'!R27","v":0},{"$f":"PRAC1!R27","v":0},{"$f":"'AUT1'!R27","v":0},0,{"$f":"VLOOKUP(K34,RESERVADO!A$1:B$1001,2)","v":"CERO"}]
[null,null,23,{"$f":"IF('AS1'!D27=\"\",\"\",'AS1'!D27)","v":""},{"$f":"IF('AS1'!E27=\"\",\"\",'AS1'!E27)","v":""},{"$f":"'AS1'!BF27","v":0},0,{"$f":"'DOC1'!R28","v":0},{"$f":"PRAC1!R28","v":0},{"$f":"'AUT1'!R28","v":3},3,{"$f":"VLOOKUP(K35,RESERVADO!A$1:B$1001,2)","v":"TRES"}]
[null,null,24,{"$f":"IF('AS1'!D28=\"\",\"\",'AS1'!D28)","v":""},{"$f":"IF('AS1'!E28=\"\",\"\",'AS1'!E28)","v":""},{"$f":"'AS1'!BF28","v":0},{"$f":"IF(L$8=0,0,(F36*100)/L$8)","v":0},{"$f":"'DOC1'!R29","v":0},{"$f":"PRAC1!R29","v":0},{"$f":"'AUT1'!R29","v":0},0,{"$f":"VLOOKUP(K36,RESERVADO!A$1:B$1001,2)","v":"CERO"}]
[null,null,25,{"$f":"IF('AS1'!D29=\"\",\"\",'AS1'!D29)","v":""},{"$f":"IF('AS1'!E29=\"\",\"\",'AS1'!E29)","v":""},{"$f":"'AS1'!BF29","v":0},0,{"$f":"'DOC1'!R30","v":0},{"$f":"PRAC1!R30","v":0},{"$f":"'AUT1'!R30","v":0},0,{"$f":"VLOOKUP(K37,RESERVADO!A$1:B$1001,2)","v":"CERO"}]
[null,null,26,{"$f":"IF('AS1'!D30=\"\",\"\",'AS1'!D30)","v":""},{"$f":"IF('AS1'!E30=\"\",\"\",'AS1'!E30)","v":""},{"$f":"'AS1'!BF30","v":0},0,{"$f":"'DOC1'!R31","v":0},{"$f":"PRAC1!R31","v":0},{"$f":"'AUT1'!R31","v":0},0,{"$f":"VLOOKUP(K38,RESERVADO!A$1:B$1001,2)","v":"CERO"}]
[null,null,27,{"$f":"IF('AS1'!D31=\"\",\"\",'AS1'!D31)","v":""},{"$f":"IF('AS1'!E31=\"\",\"\",'AS1'!E31)","v":""},{"$f":"'AS1'!BF31","v":0},0,{"$f":"'DOC1'!R32","v":0},{"$f":"PRAC1!R32","v":0},{"$f":"'AUT1'!R32","v":0},0,{"$f":"VLOOKUP(K39,RESERVADO!A$1:B$1001,2)","v":"CERO"}]
[null,null,28,{"$f":"IF('AS1'!D32=\"\",\"\",'AS1'!D32)","v":""},{"$f":"IF('AS1'!E32=\"\",\"\",'AS1'!E32)","v":""},{"$f":"'AS1'!BF32","v":0},0,{"$f":"'DOC1'!R33","v":0},{"$f":"PRAC1!R33","v":0},{"$f":"'AUT1'!R33","v":0},0,{"$f":"VLOOKUP(K40,RESERVADO!A$1:B$1001,2)","v":"CERO"}]
[null,null,29,{"$f":"IF('AS1'!D33=\"\",\"\",'AS1'!D33)","v":""},{"$f":"IF('AS1'!E33=\"\",\"\",'AS1'!E33)","v":""},{"$f":"'AS1'!BF33","v":0},0,{"$f":"'DOC1'!R34","v":0},{"$f":"PRAC1!R34","v":0},{"$f":"'AUT1'!R34","v":0},0,{"$f":"VLOOKUP(K41,RESERVADO!A$1:B$1001,2)","v":"CERO"}]
[null,null,30,{"$f":"IF('AS1'!D34=\"\",\"\",'AS1'!D34)","v":""},{"$f":"IF('AS1'!E34=\"\",\"\",'AS1'!E34)","v":""},{"$f":"'AS1'!BF34","v":0},0,{"$f":"'DOC1'!R35","v":0},{"$f":"PRAC1!R35","v":0},{"$f":"'AUT1'!R35","v":0},0,{"$f":"VLOOKUP(K42,RESERVADO!A$1:B$1001,2)","v":"CERO"}]
[null,null,31,{"$f":"IF('AS1'!D35=\"\",\"\",'AS1'!D35)","v":""},{"$f":"IF('AS1'!E35=\"\",\"\",'AS1'!E35)","v":""},{"$f":"'AS1'!BF35","v":0},0,{"$f":"'DOC1'!R36","v":0},{"$f":"PRAC1!R36","v":0},{"$f":"'AUT1'!R36","v":0},0,{"$f":"VLOOKUP(K43,RESERVADO!A$1:B$1001,2)","v":"CERO"}]
[null,null,32,{"$f":"IF('AS1'!D36=\"\",\"\",'AS1'!D36)","v":""},{"$f":"IF('AS1'!E36=\"\",\"\",'AS1'!E36)","v":""},{"$f":"'AS1'!BF36","v":0},0,{"$f":"'DOC1'!R37","v":0},{"$f":"PRAC1!R37","v":0},{"$f":"'AUT1'!R37","v":0},0,{"$f":"VLOOKUP(K44,RESERVADO!A$1:B$1001,2)","v":"CERO"}]
[null,null,33,{"$f":"IF('AS1'!D37=\"\",\"\",'AS1'!D37)","v":""},{"$f":"IF('AS1'!E37=\"\",\"\",'AS1'!E37)","v":""},{"$f":"'AS1'!BF37","v":0},0,{"$f":"'DOC1'!R38","v":0},{"$f":"PRAC1!R38","v":0},{"$f":"'AUT1'!R38","v":0},0,{"$f":"VLOOKUP(K45,RESERVADO!A$1:B$1001,2)","v":"CERO"}]
[null,null,34,{"$f":"IF('AS1'!D38=\"\",\"\",'AS1'!D38)","v":""},{"$f":"IF('AS1'!E38=\"\",\"\",'AS1'!E38)","v":""},{"$f":"'AS1'!BF38","v":0},0,{"$f":"'DOC1'!R39","v":0},{"$f":"PRAC1!R39","v":0},{"$f":"'AUT1'!R39","v":0},0,{"$f":"VLOOKUP(K46,RESERVADO!A$1:B$1001,2)","v":"CERO"}]
[null,null,35,{"$f":"IF('AS1'!D39=\"\",\"\",'AS1'!D39)","v":""},{"$f":"IF('AS1'!E39=\"\",\"\",'AS1'!E39)","v":""},{"$f":"'AS1'!BF39","v":0},0,{"$f":"'DOC1'!R40","v":0},{"$f":"PRAC1!R40","v":0},{"$f":"'AUT1'!R40","v":0},0,{"$f":"VLOOKUP(K47,RESERVADO!A$1:B$1001,2)","v":"CERO"}]
[null,null,36,{"$f":"IF('AS1'!D40=\"\",\"\",'AS1'!D40)","v":""},{"$f":"IF('AS1'!E40=\"\",\"\",'AS1'!E40)","v":""},{"$f":"'AS1'!BF40","v":0},0,{"$f":"'DOC1'!R41","v":0},{"$f":"PRAC1!R41","v":0},{"$f":"'AUT1'!R41","v":0},0,{"$f":"VLOOKUP(K48,RESERVADO!A$1:B$1001,2)","v":"CERO"}]
[null,null,37,{"$f":"IF('AS1'!D41=\"\",\"\",'AS1'!D41)","v":""},{"$f":"IF('AS1'!E41=\"\",\"\",'AS1'!E41)","v":""},{"$f":"'AS1'!BF41","v":0},0,{"$f":"'DOC1'!R42","v":0},{"$f":"PRAC1!R42","v":0},{"$f":"'AUT1'!R42","v":0},0,{"$f":"VLOOKUP(K49,RESERVADO!A$1:B$1001,2)","v":"CERO"}]
[null,null,38,{"$f":"IF('AS1'!D42=\"\",\"\",'AS1'!D42)","v":""},{"$f":"IF('AS1'!E42=\"\",\"\",'AS1'!E42)","v":""},{"$f":"'AS1'!BF42","v":0},0,{"$f":"'DOC1'!R43","v":0},{"$f":"PRAC1!R43","v":0},{"$f":"'AUT1'!R43","v":0},0,{"$f":"VLOOKUP(K50,RESERVADO!A$1:B$1001,2)","v":"CERO"}]
[null,null,39,{"$f":"IF('AS1'!D43=\"\",\"\",'AS1'!D43)","v":""},{"$f":"IF('AS1'!E43=\"\",\"\",'AS1'!E43)","v":""},{"$f":"'AS1'!BF43","v":0},0,{"$f":"'DOC1'!R44","v":0},{"$f":"PRAC1!R44","v":0},{"$f":"'AUT1'!R44","v":0},0,{"$f":"VLOOKUP(K51,RESERVADO!A$1:B$1001,2)","v":"CERO"}]
[null,null,40,{"$f":"IF('AS1'!D44=\"\",\"\",'AS1'!D44)","v":""},{"$f":"IF('AS1'!E44=\"\",\"\",'AS1'!E44)","v":""},{"$f":"'AS1'!BF44","v":0},0,{"$f":"'DOC1'!R45","v":0},{"$f":"PRAC1!R45","v":0},{"$f":"'AUT1'!R45","v":0},0,{"$f":"VLOOKUP(K52,RESERVADO!A$1:B$1001,2)","v":"CERO"}]
[null,null,41,{"$f":"IF('AS1'!D45=\"\",\"\",'AS1'!D45)","v":""},{"$f":"IF('AS1'!E45=\"\",\"\",'AS1'!E45)","v":""},{"$f":"'AS1'!BF45","v":0},0,{"$f":"'DOC1'!R46","v":0},{"$f":"PRAC1!R46","v":0},{"$f":"'AUT1'!R46","v":0},0,{"$f":"VLOOKUP(K53,RESERVADO!A$1:B$1001,2)","v":"CERO"}]
[null,null,42,{"$f":"IF('AS1'!D46=\"\",\"\",'AS1'!D46)","v":""},{"$f":"IF('AS1'!E46=\"\",\"\",'AS1'!E46)","v":""},{"$f":"'AS1'!BF46","v":0},0,{"$f":"'DOC1'!R47","v":0},{"$f":"PRAC1!R47","v":0},{"$f":"'AUT1'!R47","v":0},0,{"$f":"VLOOKUP(K54,RESERVADO!A$1:B$1001,2)","v":"CERO"}]
[null,null,43,{"$f":"IF('AS1'!D47=\"\",\"\",'AS1'!D47)","v":""},{"$f":"IF('AS1'!E47=\"\",\"\",'AS1'!E47)","v":""},{"$f":"'AS1'!BF47","v":0},0,{"$f":"'DOC1'!R48","v":0},{"$f":"PRAC1!R48","v":0},{"$f":"'AUT1'!R48","v":0},0,{"$f":"VLOOKUP(K55,RESERVADO!A$1:B$1001,2)","v":"CERO"}]
[null,null,44,{"$f":"IF('AS1'!D48=\"\",\"\",'AS1'!D48)","v":""},{"$f":"IF('AS1'!E48=\"\",\"\",'AS1'!E48)","v":""},{"$f":"'AS1'!BF48","v":0},0,{"$f":"'DOC1'!R49","v":0},{"$f":"PRAC1!R49","v":0},{"$f":"'AUT1'!R49","v":0},0,{"$f":"VLOOKUP(K56,RESERVADO!A$1:B$1001,2)","v":"CERO"}]
[null,null,45,{"$f":"IF('AS1'!D49=\"\",\"\",'AS1'!D49)","v":""},{"$f":"IF('AS1'!E49=\"\",\"\",'AS1'!E49)","v":""},{"$f":"'AS1'!BF49","v":0},0,{"$f":"'DOC1'!R50","v":0},{"$f":"PRAC1!R50","v":0},{"$f":"'AUT1'!R50","v":0},0,{"$f":"VLOOKUP(K57,RESERVADO!A$1:B$1001,2)","v":"CERO"}]
[null,null,46,{"$f":"IF('AS1'!D50=\"\",\"\",'AS1'!D50)","v":""},{"$f":"IF('AS1'!E50=\"\",\"\",'AS1'!E50)","v":""},{"$f":"'AS1'!BF50","v":0},0,{"$f":"'DOC1'!R51","v":0},{"$f":"PRAC1!R51","v":0},{"$f":"'AUT1'!R51","v":0},0,{"$f":"VLOOKUP(K58,RESERVADO!A$1:B$1001,2)","v":"CERO"}]
[null,null,47,{"$f":"IF('AS1'!D51=\"\",\"\",'AS1'!D51)","v":""},{"$f":"IF('AS1'!E51=\"\",\"\",'AS1'!E51)","v":""},{"$f":"'AS1'!BF51","v":0},0,{"$f":"'DOC1'!R52","v":0},{"$f":"PRAC1!R52","v":0},{"$f":"'AUT1'!R52","v":0},0,{"$f":"VLOOKUP(K59,RESERVADO!A$1:B$1001,2)","v":"CERO"}]
[null,null,48,{"$f":"IF('AS1'!D52=\"\",\"\",'AS1'!D52)","v":""},{"$f":"IF('AS1'!E52=\"\",\"\",'AS1'!E52)","v":""},{"$f":"'AS1'!BF52","v":0},0,{"$f":"'DOC1'!R53","v":0},{"$f":"PRAC1!R53","v":0},{"$f":"'AUT1'!R53","v":0},0,{"$f":"VLOOKUP(K60,RESERVADO!A$1:B$1001,2)","v":"CERO"}]
[null,null,49,{"$f":"IF('AS1'!D53=\"\",\"\",'AS1'!D53)","v":""},{"$f":"IF('AS1'!E53=\"\",\"\",'AS1'!E53)","v":""},{"$f":"'AS1'!BF53","v":0},0,{"$f":"'DOC1'!R54","v":0},{"$f":"PRAC1!R54","v":0},{"$f":"'AUT1'!R54","v":0},0,{"$f":"VLOOKUP(K61,RESERVADO!A$1:B$1001,2)","v":"CERO"}]
[null,null,50,{"$f":"IF('AS1'!D54=\"\",\"\",'AS1'!D54)","v":""},{"$f":"IF('AS1'!E54=\"\",\"\",'AS1'!E54)","v":""},{"$f":"'AS1'!BF54","v":0},0,{"$f":"'DOC1'!R55","v":0},{"$f":"PRAC1!R55","v":0},{"$f":"'AUT1'!R55","v":0},0,{"$f":"VLOOKUP(K62,RESERVADO!A$1:B$1001,2)","v":"CERO"}]
[null,null,51,{"$f":"IF('AS1'!D55=\"\",\"\",'AS1'!D55)","v":""},{"$f":"IF('AS1'!E55=\"\",\"\",'AS1'!E55)","v":""},{"$f":"'AS1'!BF55","v":0},0,{"$f":"'DOC1'!R56","v":0},{"$f":"PRAC1!R56","v":0},{"$f":"'AUT1'!R56","v":0},0,{"$f":"VLOOKUP(K63,RESERVADO!A$1:B$1001,2)","v":"CERO"}]
[null,null,52,{"$f":"IF('AS1'!D56=\"\",\"\",'AS1'!D56)","v":""},{"$f":"IF('AS1'!E56=\"\",\"\",'AS1'!E56)","v":""},{"$f":"'AS1'!BF56","v":0},0,{"$f":"'DOC1'!R57","v":0},{"$f":"PRAC1!R57","v":0},{"$f":"'AUT1'!R57","v":0},0,{"$f":"VLOOKUP(K64,RESERVADO!A$1:B$1001,2)","v":"CERO"}]
[null,null,53,{"$f":"IF('AS1'!D57=\"\",\"\",'AS1'!D57)","v":""},{"$f":"IF('AS1'!E57=\"\",\"\",'AS1'!E57)","v":""},{"$f":"'AS1'!BF57","v":0},0,{"$f":"'DOC1'!R58","v":0},{"$f":"PRAC1!R58","v":0},{"$f":"'AUT1'!R58","v":0},0,{"$f":"VLOOKUP(K65,RESERVADO!A$1:B$1001,2)","v":"CERO"}]
[null,null,54,{"$f":"IF('AS1'!D58=\"\",\"\",'AS1'!D58)","v":""},{"$f":"IF('AS1'!E58=\"\",\"\",'AS1'!E58)","v":""},{"$f":"'AS1'!BF58","v":0},0,{"$f":"'DOC1'!R59","v":0},{"$f":"PRAC1!R59","v":0},{"$f":"'AUT1'!R59","v":0},0,{"$f":"VLOOKUP(K66,RESERVADO!A$1:B$1001,2)","v":"CERO"}]
[null,null,55,{"$f":"IF('AS1'!D59=\"\",\"\",'AS1'!D59)","v":""},{"$f":"IF('AS1'!E59=\"\",\"\",'AS1'!E59)","v":""},{"$f":"'AS1'!BF59","v":0},0,{"$f":"'DOC1'!R60","v":0},{"$f":"PRAC1!R60","v":0},{"$f":"'AUT1'!R60","v":0},0,{"$f":"VLOOKUP(K67,RESERVADO!A$1:B$1001,2)","v":"CERO"}]
[null,null,56,{"$f":"IF('AS1'!D60=\"\",\"\",'AS1'!D60)","v":""},{"$f":"IF('AS1'!E60=\"\",\"\",'AS1'!E60)","v":""},{"$f":"'AS1'!BF60","v":0},0,{"$f":"'DOC1'!R61","v":0},{"$f":"PRAC1!R61","v":0},{"$f":"'AUT1'!R61","v":0},0,{"$f":"VLOOKUP(K68,RESERVADO!A$1:B$1001,2)","v":"CERO"}]
[null,null,57,{"$f":"IF('AS1'!D61=\"\",\"\",'AS1'!D61)","v":""},{"$f":"IF('AS1'!E61=\"\",\"\",'AS1'!E61)","v":""},{"$f":"'AS1'!BF61","v":0},0,{"$f":"'DOC1'!R62","v":0},{"$f":"PRAC1!R62","v":0},{"$f":"'AUT1'!R62","v":0},0,{"$f":"VLOOKUP(K69,RESERVADO!A$1:B$1001,2)","v":"CERO"}]
[null,null,58,{"$f":"IF('AS1'!D62=\"\",\"\",'AS1'!D62)","v":""},{"$f":"IF('AS1'!E62=\"\",\"\",'AS1'!E62)","v":""},{"$f":"'AS1'!BF62","v":0},0,{"$f":"'DOC1'!R63","v":0},{"$f":"PRAC1!R63","v":0},{"$f":"'AUT1'!R63","v":0},0,{"$f":"VLOOKUP(K70,RESERVADO!A$1:B$1001,2)","v":"CERO"}]
[null,null,59,{"$f":"IF('AS1'!D63=\"\",\"\",'AS1'!D63)","v":""},{"$f":"IF('AS1'!E63=\"\",\"\",'AS1'!E63)","v":""},{"$f":"'AS1'!BF63","v":0},0,{"$f":"'DOC1'!R64","v":0},{"$f":"PRAC1!R64","v":0},{"$f":"'AUT1'!R64","v":0},0,{"$f":"VLOOKUP(K71,RESERVADO!A$1:B$1001,2)","v":"CERO"}]
[null,null,60,{"$f":"IF('AS1'!D64=\"\",\"\",'AS1'!D64)","v":""},{"$f":"IF('AS1'!E64=\"\",\"\",'AS1'!E64)","v":""},{"$f":"'AS1'!BF64","v":0},0,{"$f":"'DOC1'!R65","v":0},{"$f":"PRAC1!R65","v":0},{"$f":"'AUT1'!R65","v":0},0,{"$f":"VLOOKUP(K72,RESERVADO!A$1:B$1001,2)","v":"CERO"}]
[null,null,61,{"$f":"IF('AS1'!D65=\"\",\"\",'AS1'!D65)","v":""},{"$f":"IF('AS1'!E65=\"\",\"\",'AS1'!E65)","v":""},{"$f":"'AS1'!BF65","v":0},0,{"$f":"'DOC1'!R66","v":0},{"$f":"PRAC1!R66","v":0},{"$f":"'AUT1'!R66","v":0},0,{"$f":"VLOOKUP(K73,RESERVADO!A$1:B$1001,2)","v":"CERO"}]
[null,null,62,{"$f":"IF('AS1'!D66=\"\",\"\",'AS1'!D66)","v":""},{"$f":"IF('AS1'!E66=\"\",\"\",'AS1'!E66)","v":""},{"$f":"'AS1'!BF66","v":0},0,{"$f":"'DOC1'!R67","v":0},{"$f":"PRAC1!R67","v":0},{"$f":"'AUT1'!R67","v":0},0,{"$f":"VLOOKUP(K74,RESERVADO!A$1:B$1001,2)","v":"CERO"}]
[null,null,63,{"$f":"IF('AS1'!D67=\"\",\"\",'AS1'!D67)","v":""},{"$f":"IF('AS1'!E67=\"\",\"\",'AS1'!E67)","v":""},{"$f":"'AS1'!BF67","v":0},0,{"$f":"'DOC1'!R68","v":0},{"$f":"PRAC1!R68","v":0},{"$f":"'AUT1'!R68","v":0},0,{"$f":"VLOOKUP(K75,RESERVADO!A$1:B$1001,2)","v":"CERO"}]
[null,null,64,{"$f":"IF('AS1'!D68=\"\",\"\",'AS1'!D68)","v":""},{"$f":"IF('AS1'!E68=\"\",\"\",'AS1'!E68)","v":""},{"$f":"'AS1'!BF68","v":0},0,{"$f":"'DOC1'!R69","v":0},{"$f":"PRAC1!R69","v":0},{"$f":"'AUT1'!R69","v":0},0,{"$f":"VLOOKUP(K76,RESERVADO!A$1:B$1001,2)","v":"CERO"}]
[null,null,65,{"$f":"IF('AS1'!D69=\"\",\"\",'AS1'!D69)","v":""},{"$f":"IF('AS1'!E69=\"\",\"\",'AS1'!E69)","v":""},{"$f":"'AS1'!BF69","v":0},0,{"$f":"'DOC1'!R70","v":0},{"$f":"PRAC1!R70","v":0},{"$f":"'AUT1'!R70","v":0},0,{"$f":"VLOOKUP(K77,RESERVADO!A$1:B$1001,2)","v":"CERO"}]
[null,null,66,{"$f":"IF('AS1'!D70=\"\",\"\",'AS1'!D70)","v":""},{"$f":"IF('AS1'!E70=\"\",\"\",'AS1'!E70)","v":""},{"$f":"'AS1'!BF70","v":0},0,{"$f":"'DOC1'!R71","v":0},{"$f":"PRAC1!R71","v":0},{"$f":"'AUT1'!R71","v":0},0,{"$f":"VLOOKUP(K78,RESERVADO!A$1:B$1001,2)","v":"CERO"}]
[null,null,67,{"$f":"IF('AS1'!D71=\"\",\"\",'AS1'!D71)","v":""},{"$f":"IF('AS1'!E71=\"\",\"\",'AS1'!E71)","v":""},{"$f":"'AS1'!BF71","v":0},0,{"$f":"'DOC1'!R72","v":0},{"$f":"PRAC1!R72","v":0},{"$f":"'AUT1'!R72","v":0},0,{"$f":"VLOOKUP(K79,RESERVADO!A$1:B$1001,2)","v":"CERO"}]
[null,null,68,{"$f":"IF('AS1'!D72=\"\",\"\",'AS1'!D72)","v":""},{"$f":"IF('AS1'!E72=\"\",\"\",'AS1'!E72)","v":""},{"$f":"'AS1'!BF72","v":0},{"$f":"IF(L$8=0,0,(F80*100)/L$8)","v":0},{"$f":"'DOC1'!R73","v":0},{"$f":"PRAC1!R73","v":0},{"$f":"'AUT1'!R73","v":0},{"$f":"ROUND(SUM(H80:J80),2)","v":0},{"$f":"VLOOKUP(K80,RESERVADO!A$1:B$1001,2)","v":"CERO"}]
[null,null,69,{"$f":"IF('AS1'!D73=\"\",\"\",'AS1'!D73)","v":""},{"$f":"IF('AS1'!E73=\"\",\"\",'AS1'!E73)","v":""},{"$f":"'AS1'!BF73","v":0},0,{"$f":"'DOC1'!R74","v":0},{"$f":"PRAC1!R74","v":0},{"$f":"'AUT1'!R74","v":0},0,{"$f":"VLOOKUP(K81,RESERVADO!A$1:B$1001,2)","v":"CERO"}]
[null,null,70,{"$f":"IF('AS1'!D74=\"\",\"\",'AS1'!D74)","v":""},{"$f":"IF('AS1'!E74=\"\",\"\",'AS1'!E74)","v":""},{"$f":"'AS1'!BF74","v":0},0,{"$f":"'DOC1'!R75","v":0},{"$f":"PRAC1!R75","v":0},{"$f":"'AUT1'!R75","v":0},0,{"$f":"VLOOKUP(K82,RESERVADO!A$1:B$1001,2)","v":"CERO"}]

{"sheet":"INFORME1","index":6,"n_rows":34,"n_cols":9,"rows_kept":34,"cut":false,"hidden":true,"merged":[[4,2,4,7],[5,2,5,7],[6,2,6,7],[2,1,2,12],[32,8,32,11],[30,1,30,10],[30,11,30,12],[14,1,14,11],[8,2,8,7],[10,2,10,7],[12,3,12,5],[7,2,7,11],[19,1,19,11],[22,2,22,4],[26,6,26,7],[32,3,32,5],[9,2,9,5],[11,3,11,5],[25,2,25,3],[25,4,25,5],[25,6,25,7],[15,3,15,5],[16,3,16,5],[17,3,17,5],[16,6,16,11],[17,6,17,11],[25,8,26,8],[26,2,26,3],[26,4,26,5],[20,2,20,4],[23,2,23,4],[46,3,46,5],[15,6,15,11],[37,8,37,11],[38,8,38,11],[33,8,33,11],[34,8,34,11],[35,8,35,11],[36,8,36,11],[44,8,44,11],[45,8,45,11],[39,8,39,11],[40,8,40,11],[41,8,41,11],[42,8,42,11],[43,8,43,11],[21,2,21,4]]}
[]
[]
[null,"INFORME ACADÉMICO"]
[]
[null,null,{"$f":"CONCATENATE(INICIO!C7,INICIO!D7)","v":"PERIODO ACADÉMICO:  2024 -  2025"}]
[null,null,{"$f":"CONCATENATE(INICIO!C5,INICIO!D5)","v":"FACULTAD:  Ciencias de la Salud"}]
[null,null,{"$f":"CONCATENATE(INICIO!C6,INICIO!D6)","v":"CARRERA: Enfermería"}]
[null,null,"ESTADO: Vigente ( X  )   No Vigente habilitada para registro de títulos (   )"]
[null,null,{"$f":"CONCATENATE(INICIO!C8,INICIO!D8,\" \",INICIO!D9)","v":"SEMESTRE: 6to A"}]
[null,null,{"$f":"CONCATENATE(INICIO!C11,INICIO!D11)","v":"ASIGNATURA: Enfermería Gíneco oObstétrica II"}]
[null,null,"PARCIAL: Primero ( X )  Segundo ( )"]
[null,null,"PROFESOR:",{"$f":"IF(INICIO!D4=\"\",\"\",INICIO!D4)","v":"Graciela Rivera Herrera"}]
[null,null,"FECHA:",{"$f":"TODAY()","v":"2025-02-14"}]
[]
[null,"1.    Resultados de aprendizaje evaluados"]
[null,null,"N° Unidad","Nombre unidad",null,null,"Resultados de aprendizaje"]
[]
[]
[]
[null,"2.    Rendimiento Académico"]
[null,null,"Promedio de asistencia del curso:",null,null,{"$f":"CONCATENATE(ROUND(IF(F23=0,0,AVERAGEIF(PARCIAL1!G13:G82,\">0\")),2),\" \",\"%\")","v":"91,83 %"}]
[null,null,"Promedio de calificaciones del curso: ",null,null,{"$f":"IF(F23=0,0,AVERAGEIF(PARCIAL1!K13:K82,\">0\"))","v":6.3544444444444448}]
[null,null,"Numero Total de Estudiantes:",null,null,{"$f":"COUNTIF('AS1'!E5:E74,\"*\")","v":8}]
[null,null,"Número de Estudiantes sin Calificaciones:",null,null,{"$f":"COUNTIFS(PARCIAL1!K13:K82,\"=0\",PARCIAL1!E13:E82,\">*\")","v":0}]
[null,null,"Evaluación del logro de los  resultados de aprendizaje:"]
[null,null,"1.00 - 4.00 ",null,"4.01 - 6.99",null,"7.00 – 10.00",null,"Total de Matriculados"]
[null,null,"No alcanza los resultados de aprendizaje requeridos",null,"Está próximo a alcanzar los resultados de aprendizaje requeridos.",null,"Alcanza los resultados de aprendizaje requeridos satisfactoriamente"]
[null,null,"Número",{"$f":"(F23-(H28+F28))-F24","v":1},"Número",{"$f":"COUNTIFS(PARCIAL1!K13:K82,\">=4,01\",PARCIAL1!K13:K82,\"<=6,99\")","v":2},"Número",{"$f":"COUNTIF(PARCIAL1!K13:K82,\">=7\")","v":5},{"$f":"F23-F24","v":8}]
[null,null,"%",{"$f":"IF($I$28>0,(D28*100%)/$I$28,\" \")","v":0.125},"%",{"$f":"IF($I$28>0,(F28*100%)/$I$28,\" \")","v":0.25},"%",{"$f":"IF($I$28>0,(H28*100%)/$I$28,\" \")","v":0.625},1]
[]
[null,"3.    Registro de estudiantes que no alcanzan o están próximos a alcanzar los resultados de aprendizaje requeridos "]
[]
[null,null,"N°","Estudiante",null,null,"Calificación Primer Parcial","% de Asistencia Primer Parcial","Causas del bajo rendimiento académico de los estudiantes"]
[null,null,70,null,null,null,0,0]

{"sheet":"AS2","index":7,"n_rows":74,"n_cols":141,"rows_kept":74,"cut":false,"hidden":false,"merged":[[1,51,2,56],[1,57,2,58],[2,4,2,23]]}
[]
[null,null,null,null,null,null,null,null,null,null,null,"ASISTENCIAS REGISTRADAS EN EL SEGUNDO PARCIAL",null,null,null,null,null,null,null,null,null,null,null,null,null,null,null,null,null,null,null,null,null,null,null,null,null,null,null,null,null,null,null,null,null,null,null,null,null,null,null,"Total horas trabajadas",null,null,null,null,null,{"$f":"COUNT(F5:BE5)*INICIO!D12","v":54}]
[null,null,null,null,"RECUERDE USTED TIENE",null,null,null,null,null,null,null,null,null,null,null,null,null,null,null,null,null,null,null,{"$f":"INICIO!D12","v":2},"HORAS DE CLASE AL DÍA CON ESTE CURSO"]
[null,null,"N","NUMERO DE CÉDULA","APELLIDOS Y NOMBRES","2024-12-03","2024-12-04","5/112-24","2024-12-10","2024-12-11","2024-12-12","2024-12-17","2024-12-18","2024-12-19","1900-01-07","1900-01-08","1900-01-09","1900-01-14","1900-01-15","1900-01-16","1900-01-21","1900-01-22","1900-01-23","1900-01-28","1900-01-29","1900-01-30","2025-02-04","2025-02-05","2025-02-06","2025-02-11","2025-02-12","2025-02-13",null,null,null,null,null,null,null,null,null,null,null,null,null,null,null,null,null,null,null,null,null,null,null,null,null,"HORAS ASISTIDAS","CALIFICACION ASISTENCIA"]
[null,null,1,{"$f":"IF('AS1'!D5=\"\",\"\",'AS1'!D5)","v":""},{"$f":"IF('AS1'!E5=\"\",\"\",'AS1'!E5)","v":"DAQUILEMA LONDO SHIRLEY ESTEFAFANÍA"},2,2,2,2,2,2,2,2,2,2,2,2,2,2,2,2,2,2,2,2,2,2,2,2,2,2,2,null,null,null,null,null,null,null,null,null,null,null,null,null,null,null,null,null,null,null,null,null,null,null,null,null,{"$f":"SUM(F5:BE5)","v":54},{"$f":"IF(PARCIAL1!L$8=0,0,(ROUND(((BF5*10)/PARCIAL2!L$8),1)))","v":10},null,{"$f":"IF(E5>$Y$3,0,E5)","v":0},2,2,2,2,2,2,2,2,2,2,2,2,2,2,2,{"$f":"IF(U5>$Y$3,0,U5)","v":2},2,2,2,2,2,2,2,2,2,2,2,0,0,0,0,{"$f":"IF(AK5>$Y$3,0,AK5)","v":0},0,0,0,0,0,0,0,0,0,0,0,0,0,0,0,{"$f":"IF(BA5>$Y$3,0,BA5)","v":0},0,0,0,0,{"$f":"IF(#REF!>$Y$3,0,#REF!)","v":{"$error":"#REF!"}},{"$f":"IF(#REF!>$Y$3,0,#REF!)","v":{"$error":"#REF!"}},{"$f":"IF(#REF!>$Y$3,0,#REF!)","v":{"$error":"#REF!"}},{"$f":"IF(#REF!>$Y$3,0,#REF!)","v":{"$error":"#REF!"}},{"$f":"IF(#REF!>$Y$3,0,#REF!)","v":{"$error":"#REF!"}},{"$f":"IF(#REF!>$Y$3,0,#REF!)","v":{"$error":"#REF!"}},{"$f":"IF(#REF!>$Y$3,0,#REF!)","v":{"$error":"#REF!"}},{"$f":"IF(#REF!>$Y$3,0,#REF!)","v":{"$error":"#REF!"}},{"$f":"IF(#REF!>$Y$3,0,#REF!)","v":{"$error":"#REF!"}},{"$f":"IF(#REF!>$Y$3,0,#REF!)","v":{"$error":"#REF!"}},{"$f":"IF(#REF!>$Y$3,0,#REF!)","v":{"$error":"#REF!"}},{"$f":"IF(#REF!>$Y$3,0,#REF!)","v":{"$error":"#REF!"}},{"$f":"IF(#REF!>$Y$3,0,#REF!)","v":{"$error":"#REF!"}},{"$f":"IF(#REF!>$Y$3,0,#REF!)","v":{"$error":"#REF!"}},{"$f":"IF(#REF!>$Y$3,0,#REF!)","v":{"$error":"#REF!"}},{"$f":"IF(#REF!>$Y$3,0,#REF!)","v":{"$error":"#REF!"}},{"$f":"IF(#REF!>$Y$3,0,#REF!)","v":{"$error":"#REF!"}},{"$f":"IF(#REF!>$Y$3,0,#REF!)","v":{"$error":"#REF!"}},{"$f":"IF(#REF!>$Y$3,0,#REF!)","v":{"$error":"#REF!"}},{"$f":"IF(#REF!>$Y$3,0,#REF!)","v":{"$error":"#REF!"}},{"$f":"IF(#REF!>$Y$3,0,#REF!)","v":{"$error":"#REF!"}},{"$f":"IF(#REF!>$Y$3,0,#REF!)","v":{"$error":"#REF!"}},{"$f":"IF(#REF!>$Y$3,0,#REF!)","v":{"$error":"#REF!"}},{"$f":"IF(#REF!>$Y$3,0,#REF!)","v":{"$error":"#REF!"}},{"$f":"IF(#REF!>$Y$3,0,#REF!)","v":{"$error":"#REF!"}},{"$f":"IF(#REF!>$Y$3,0,#REF!)","v":{"$error":"#REF!"}},{"$f":"IF(#REF!>$Y$3,0,#REF!)","v":{"$error":"#REF!"}},{"$f":"IF(#REF!>$Y$3,0,#REF!)","v":{"$error":"#REF!"}}]
[null,null,2,{"$f":"IF('AS1'!D6=\"\",\"\",'AS1'!D6)","v":""},{"$f":"IF('AS1'!E6=\"\",\"\",'AS1'!E6)","v":"GOYES ORTIZ NATASHA DAYANA"},2,2,2,2,2,2,2,2,2,2,2,2,2,2,2,2,2,2,2,2,2,2,2,2,2,2,2,null,null,null,null,null,null,null,null,null,null,null,null,null,null,null,null,null,null,null,null,null,null,null,null,null,{"$f":"SUM(F6:BE6)","v":54},{"$f":"IF(PARCIAL1!L$8=0,0,(ROUND(((BF6*10)/PARCIAL2!L$8),1)))","v":10},null,0,2,2,2,2,2,2,2,2,2,2,2,2,2,2,2,2,2,2,2,2,2,2,2,2,2,2,2,0,0,0,0,0,0,0,0,0,0,0,0,0,0,0,0,0,0,0,0,0,0,0,0,0,{"$f":"IF(#REF!>$Y$3,0,#REF!)","v":{"$error":"#REF!"}},{"$f":"IF(#REF!>$Y$3,0,#REF!)","v":{"$error":"#REF!"}},{"$f":"IF(#REF!>$Y$3,0,#REF!)","v":{"$error":"#REF!"}},{"$f":"IF(#REF!>$Y$3,0,#REF!)","v":{"$error":"#REF!"}},{"$f":"IF(#REF!>$Y$3,0,#REF!)","v":{"$error":"#REF!"}},{"$f":"IF(#REF!>$Y$3,0,#REF!)","v":{"$error":"#REF!"}},{"$f":"IF(#REF!>$Y$3,0,#REF!)","v":{"$error":"#REF!"}},{"$f":"IF(#REF!>$Y$3,0,#REF!)","v":{"$error":"#REF!"}},{"$f":"IF(#REF!>$Y$3,0,#REF!)","v":{"$error":"#REF!"}},{"$f":"IF(#REF!>$Y$3,0,#REF!)","v":{"$error":"#REF!"}},{"$f":"IF(#REF!>$Y$3,0,#REF!)","v":{"$error":"#REF!"}},{"$f":"IF(#REF!>$Y$3,0,#REF!)","v":{"$error":"#REF!"}},{"$f":"IF(#REF!>$Y$3,0,#REF!)","v":{"$error":"#REF!"}},{"$f":"IF(#REF!>$Y$3,0,#REF!)","v":{"$error":"#REF!"}},{"$f":"IF(#REF!>$Y$3,0,#REF!)","v":{"$error":"#REF!"}},{"$f":"IF(#REF!>$Y$3,0,#REF!)","v":{"$error":"#REF!"}},{"$f":"IF(#REF!>$Y$3,0,#REF!)","v":{"$error":"#REF!"}},{"$f":"IF(#REF!>$Y$3,0,#REF!)","v":{"$error":"#REF!"}},{"$f":"IF(#REF!>$Y$3,0,#REF!)","v":{"$error":"#REF!"}},{"$f":"IF(#REF!>$Y$3,0,#REF!)","v":{"$error":"#REF!"}},{"$f":"IF(#REF!>$Y$3,0,#REF!)","v":{"$error":"#REF!"}},{"$f":"IF(#REF!>$Y$3,0,#REF!)","v":{"$error":"#REF!"}},{"$f":"IF(#REF!>$Y$3,0,#REF!)","v":{"$error":"#REF!"}},{"$f":"IF(#REF!>$Y$3,0,#REF!)","v":{"$error":"#REF!"}},{"$f":"IF(#REF!>$Y$3,0,#REF!)","v":{"$error":"#REF!"}},{"$f":"IF(#REF!>$Y$3,0,#REF!)","v":{"$error":"#REF!"}},{"$f":"IF(#REF!>$Y$3,0,#REF!)","v":{"$error":"#REF!"}},{"$f":"IF(#REF!>$Y$3,0,#REF!)","v":{"$error":"#REF!"}}]
[null,null,3,{"$f":"IF('AS1'!D7=\"\",\"\",'AS1'!D7)","v":""},{"$f":"IF('AS1'!E7=\"\",\"\",'AS1'!E7)","v":"GUADALUPE RUIZ YULISA NATALY"},2,2,2,2,2,2,2,2,2,2,2,2,2,2,2,2,2,2,2,2,2,2,2,2,2,2,2,null,null,null,null,null,null,null,null,null,null,null,null,null,null,null,null,null,null,null,null,null,null,null,null,null,{"$f":"SUM(F7:BE7)","v":54},{"$f":"IF(PARCIAL1!L$8=0,0,(ROUND(((BF7*10)/PARCIAL2!L$8),1)))","v":10},null,null,2,2,2,2,2,2,2,2,2,2,2,2,2,2,2,2,2,2,2,2,2,2,2,2,2,2,2,0,0,0,0,0,0,0,0,0,0,0,0,0,0,0,0,0,0,0,0,0,0,0,0,0,{"$f":"IF(#REF!>$Y$3,0,#REF!)","v":{"$error":"#REF!"}},{"$f":"IF(#REF!>$Y$3,0,#REF!)","v":{"$error":"#REF!"}},{"$f":"IF(#REF!>$Y$3,0,#REF!)","v":{"$error":"#REF!"}},{"$f":"IF(#REF!>$Y$3,0,#REF!)","v":{"$error":"#REF!"}},{"$f":"IF(#REF!>$Y$3,0,#REF!)","v":{"$error":"#REF!"}},{"$f":"IF(#REF!>$Y$3,0,#REF!)","v":{"$error":"#REF!"}},{"$f":"IF(#REF!>$Y$3,0,#REF!)","v":{"$error":"#REF!"}},{"$f":"IF(#REF!>$Y$3,0,#REF!)","v":{"$error":"#REF!"}},{"$f":"IF(#REF!>$Y$3,0,#REF!)","v":{"$error":"#REF!"}},{"$f":"IF(#REF!>$Y$3,0,#REF!)","v":{"$error":"#REF!"}},{"$f":"IF(#REF!>$Y$3,0,#REF!)","v":{"$error":"#REF!"}},{"$f":"IF(#REF!>$Y$3,0,#REF!)","v":{"$error":"#REF!"}},{"$f":"IF(#REF!>$Y$3,0,#REF!)","v":{"$error":"#REF!"}},{"$f":"IF(#REF!>$Y$3,0,#REF!)","v":{"$error":"#REF!"}},{"$f":"IF(#REF!>$Y$3,0,#REF!)","v":{"$error":"#REF!"}},{"$f":"IF(#REF!>$Y$3,0,#REF!)","v":{"$error":"#REF!"}},{"$f":"IF(#REF!>$Y$3,0,#REF!)","v":{"$error":"#REF!"}},{"$f":"IF(#REF!>$Y$3,0,#REF!)","v":{"$error":"#REF!"}},{"$f":"IF(#REF!>$Y$3,0,#REF!)","v":{"$error":"#REF!"}},{"$f":"IF(#REF!>$Y$3,0,#REF!)","v":{"$error":"#REF!"}},{"$f":"IF(#REF!>$Y$3,0,#REF!)","v":{"$error":"#REF!"}},{"$f":"IF(#REF!>$Y$3,0,#REF!)","v":{"$error":"#REF!"}},{"$f":"IF(#REF!>$Y$3,0,#REF!)","v":{"$error":"#REF!"}},{"$f":"IF(#REF!>$Y$3,0,#REF!)","v":{"$error":"#REF!"}},{"$f":"IF(#REF!>$Y$3,0,#REF!)","v":{"$error":"#REF!"}},{"$f":"IF(#REF!>$Y$3,0,#REF!)","v":{"$error":"#REF!"}},{"$f":"IF(#REF!>$Y$3,0,#REF!)","v":{"$error":"#REF!"}},{"$f":"IF(#REF!>$Y$3,0,#REF!)","v":{"$error":"#REF!"}}]
[null,null,4,{"$f":"IF('AS1'!D8=\"\",\"\",'AS1'!D8)","v":""},{"$f":"IF('AS1'!E8=\"\",\"\",'AS1'!E8)","v":"MELO CHAVEZ KEVIN JOSUE"},2,2,2,2,2,2,2,2,2,2,2,2,0,2,0,2,2,2,2,2,2,2,2,2,2,2,2,null,null,null,null,null,null,null,null,null,null,null,null,null,null,null,null,null,null,null,null,null,null,null,null,null,{"$f":"SUM(F8:BE8)","v":50},{"$f":"IF(PARCIAL1!L$8=0,0,(ROUND(((BF8*10)/PARCIAL2!L$8),1)))","v":9.3000000000000007},null,null,2,2,2,2,2,2,2,2,2,2,2,2,0,2,0,2,2,2,2,2,2,2,2,2,2,2,2,0,0,0,0,0,0,0,0,0,0,0,0,0,0,0,0,0,0,0,0,0,0,0,0,0,{"$f":"IF(#REF!>$Y$3,0,#REF!)","v":{"$error":"#REF!"}},{"$f":"IF(#REF!>$Y$3,0,#REF!)","v":{"$error":"#REF!"}},{"$f":"IF(#REF!>$Y$3,0,#REF!)","v":{"$error":"#REF!"}},{"$f":"IF(#REF!>$Y$3,0,#REF!)","v":{"$error":"#REF!"}},{"$f":"IF(#REF!>$Y$3,0,#REF!)","v":{"$error":"#REF!"}},{"$f":"IF(#REF!>$Y$3,0,#REF!)","v":{"$error":"#REF!"}},{"$f":"IF(#REF!>$Y$3,0,#REF!)","v":{"$error":"#REF!"}},{"$f":"IF(#REF!>$Y$3,0,#REF!)","v":{"$error":"#REF!"}},{"$f":"IF(#REF!>$Y$3,0,#REF!)","v":{"$error":"#REF!"}},{"$f":"IF(#REF!>$Y$3,0,#REF!)","v":{"$error":"#REF!"}},{"$f":"IF(#REF!>$Y$3,0,#REF!)","v":{"$error":"#REF!"}},{"$f":"IF(#REF!>$Y$3,0,#REF!)","v":{"$error":"#REF!"}},{"$f":"IF(#REF!>$Y$3,0,#REF!)","v":{"$error":"#REF!"}},{"$f":"IF(#REF!>$Y$3,0,#REF!)","v":{"$error":"#REF!"}},{"$f":"IF(#REF!>$Y$3,0,#REF!)","v":{"$error":"#REF!"}},{"$f":"IF(#REF!>$Y$3,0,#REF!)","v":{"$error":"#REF!"}},{"$f":"IF(#REF!>$Y$3,0,#REF!)","v":{"$error":"#REF!"}},{"$f":"IF(#REF!>$Y$3,0,#REF!)","v":{"$error":"#REF!"}},{"$f":"IF(#REF!>$Y$3,0,#REF!)","v":{"$error":"#REF!"}},{"$f":"IF(#REF!>$Y$3,0,#REF!)","v":{"$error":"#REF!"}},{"$f":"IF(#REF!>$Y$3,0,#REF!)","v":{"$error":"#REF!"}},{"$f":"IF(#REF!>$Y$3,0,#REF!)","v":{"$error":"#REF!"}},{"$f":"IF(#REF!>$Y$3,0,#REF!)","v":{"$error":"#REF!"}},{"$f":"IF(#REF!>$Y$3,0,#REF!)","v":{"$error":"#REF!"}},{"$f":"IF(#REF!>$Y$3,0,#REF!)","v":{"$error":"#REF!"}},{"$f":"IF(#REF!>$Y$3,0,#REF!)","v":{"$error":"#REF!"}},{"$f":"IF(#REF!>$Y$3,0,#REF!)","v":{"$error":"#REF!"}},{"$f":"IF(#REF!>$Y$3,0,#REF!)","v":{"$error":"#REF!"}}]
[null,null,5,{"$f":"IF('AS1'!D9=\"\",\"\",'AS1'!D9)","v":""},{"$f":"IF('AS1'!E9=\"\",\"\",'AS1'!E9)","v":"MULLO PAUCAR ADRIANA ANABEL"},2,2,2,0,2,2,2,2,2,2,2,2,2,2,2,2,2,2,2,2,2,2,2,2,2,2,2,null,null,null,null,null,null,null,null,null,null,null,null,null,null,null,null,null,null,null,null,null,null,null,null,null,52,{"$f":"IF(PARCIAL1!L$8=0,0,(ROUND(((BF9*10)/PARCIAL2!L$8),1)))","v":9.6},null,null,2,2,2,0,2,2,2,2,2,2,2,2,2,2,2,2,2,2,2,2,2,2,2,2,2,2,2,0,0,0,0,0,0,0,0,0,0,0,0,0,0,0,0,0,0,0,0,0,0,0,0,0,{"$f":"IF(#REF!>$Y$3,0,#REF!)","v":{"$error":"#REF!"}},{"$f":"IF(#REF!>$Y$3,0,#REF!)","v":{"$error":"#REF!"}},{"$f":"IF(#REF!>$Y$3,0,#REF!)","v":{"$error":"#REF!"}},{"$f":"IF(#REF!>$Y$3,0,#REF!)","v":{"$error":"#REF!"}},{"$f":"IF(#REF!>$Y$3,0,#REF!)","v":{"$error":"#REF!"}},{"$f":"IF(#REF!>$Y$3,0,#REF!)","v":{"$error":"#REF!"}},{"$f":"IF(#REF!>$Y$3,0,#REF!)","v":{"$error":"#REF!"}},{"$f":"IF(#REF!>$Y$3,0,#REF!)","v":{"$error":"#REF!"}},{"$f":"IF(#REF!>$Y$3,0,#REF!)","v":{"$error":"#REF!"}},{"$f":"IF(#REF!>$Y$3,0,#REF!)","v":{"$error":"#REF!"}},{"$f":"IF(#REF!>$Y$3,0,#REF!)","v":{"$error":"#REF!"}},{"$f":"IF(#REF!>$Y$3,0,#REF!)","v":{"$error":"#REF!"}},{"$f":"IF(#REF!>$Y$3,0,#REF!)","v":{"$error":"#REF!"}},{"$f":"IF(#REF!>$Y$3,0,#REF!)","v":{"$error":"#REF!"}},{"$f":"IF(#REF!>$Y$3,0,#REF!)","v":{"$error":"#REF!"}},{"$f":"IF(#REF!>$Y$3,0,#REF!)","v":{"$error":"#REF!"}},{"$f":"IF(#REF!>$Y$3,0,#REF!)","v":{"$error":"#REF!"}},{"$f":"IF(#REF!>$Y$3,0,#REF!)","v":{"$error":"#REF!"}},{"$f":"IF(#REF!>$Y$3,0,#REF!)","v":{"$error":"#REF!"}},{"$f":"IF(#REF!>$Y$3,0,#REF!)","v":{"$error":"#REF!"}},{"$f":"IF(#REF!>$Y$3,0,#REF!)","v":{"$error":"#REF!"}},{"$f":"IF(#REF!>$Y$3,0,#REF!)","v":{"$error":"#REF!"}},{"$f":"IF(#REF!>$Y$3,0,#REF!)","v":{"$error":"#REF!"}},{"$f":"IF(#REF!>$Y$3,0,#REF!)","v":{"$error":"#REF!"}},{"$f":"IF(#REF!>$Y$3,0,#REF!)","v":{"$error":"#REF!"}},{"$f":"IF(#REF!>$Y$3,0,#REF!)","v":{"$error":"#REF!"}},{"$f":"IF(#REF!>$Y$3,0,#REF!)","v":{"$error":"#REF!"}},{"$f":"IF(#REF!>$Y$3,0,#REF!)","v":{"$error":"#REF!"}}]
[null,null,6,{"$f":"IF('AS1'!D10=\"\",\"\",'AS1'!D10)","v":""},{"$f":"IF('AS1'!E10=\"\",\"\",'AS1'!E10)","v":"NARANJO PALACIOS FERNANDA BRIGUITTE"},null,null,null,null,null,null,null,null,null,null,null,null,null,null,null,null,null,null,null,null,null,null,null,null,null,null,null,null,null,null,null,null,null,null,null,null,null,null,null,null,null,null,null,null,null,null,null,null,null,null,null,null,0,{"$f":"IF(PARCIAL1!L$8=0,0,(ROUND(((BF10*10)/PARCIAL2!L$8),1)))","v":0},null,null,0,0,0,0,0,0,0,0,0,0,0,0,0,0,0,0,0,0,0,0,0,0,0,0,0,0,0,0,0,0,0,0,0,0,0,0,0,0,0,0,0,0,0,0,0,0,0,0,0,0,0,0,{"$f":"IF(#REF!>$Y$3,0,#REF!)","v":{"$error":"#REF!"}},{"$f":"IF(#REF!>$Y$3,0,#REF!)","v":{"$error":"#REF!"}},{"$f":"IF(#REF!>$Y$3,0,#REF!)","v":{"$error":"#REF!"}},{"$f":"IF(#REF!>$Y$3,0,#REF!)","v":{"$error":"#REF!"}},{"$f":"IF(#REF!>$Y$3,0,#REF!)","v":{"$error":"#REF!"}},{"$f":"IF(#REF!>$Y$3,0,#REF!)","v":{"$error":"#REF!"}},{"$f":"IF(#REF!>$Y$3,0,#REF!)","v":{"$error":"#REF!"}},{"$f":"IF(#REF!>$Y$3,0,#REF!)","v":{"$error":"#REF!"}},{"$f":"IF(#REF!>$Y$3,0,#REF!)","v":{"$error":"#REF!"}},{"$f":"IF(#REF!>$Y$3,0,#REF!)","v":{"$error":"#REF!"}},{"$f":"IF(#REF!>$Y$3,0,#REF!)","v":{"$error":"#REF!"}},{"$f":"IF(#REF!>$Y$3,0,#REF!)","v":{"$error":"#REF!"}},{"$f":"IF(#REF!>$Y$3,0,#REF!)","v":{"$error":"#REF!"}},{"$f":"IF(#REF!>$Y$3,0,#REF!)","v":{"$error":"#REF!"}},{"$f":"IF(#REF!>$Y$3,0,#REF!)","v":{"$error":"#REF!"}},{"$f":"IF(#REF!>$Y$3,0,#REF!)","v":{"$error":"#REF!"}},{"$f":"IF(#REF!>$Y$3,0,#REF!)","v":{"$error":"#REF!"}},{"$f":"IF(#REF!>$Y$3,0,#REF!)","v":{"$error":"#REF!"}},{"$f":"IF(#REF!>$Y$3,0,#REF!)","v":{"$error":"#REF!"}},{"$f":"IF(#REF!>$Y$3,0,#REF!)","v":{"$error":"#REF!"}},{"$f":"IF(#REF!>$Y$3,0,#REF!)","v":{"$error":"#REF!"}},{"$f":"IF(#REF!>$Y$3,0,#REF!)","v":{"$error":"#REF!"}},{"$f":"IF(#REF!>$Y$3,0,#REF!)","v":{"$error":"#REF!"}},{"$f":"IF(#REF!>$Y$3,0,#REF!)","v":{"$error":"#REF!"}},{"$f":"IF(#REF!>$Y$3,0,#REF!)","v":{"$error":"#REF!"}},{"$f":"IF(#REF!>$Y$3,0,#REF!)","v":{"$error":"#REF!"}},{"$f":"IF(#REF!>$Y$3,0,#REF!)","v":{"$error":"#REF!"}},{"$f":"IF(#REF!>$Y$3,0,#REF!)","v":{"$error":"#REF!"}}]
[null,null,7,{"$f":"IF('AS1'!D11=\"\",\"\",'AS1'!D11)","v":""},{"$f":"IF('AS1'!E11=\"\",\"\",'AS1'!E11)","v":"SOTO VARGAS ERIKA SAMANTA"},2,2,2,2,2,2,2,2,2,2,2,2,2,2,2,2,2,2,2,2,2,2,2,2,2,2,2,null,null,null,null,null,null,null,null,null,null,null,null,null,null,null,null,null,null,null,null,null,null,null,null,null,54,{"$f":"IF(PARCIAL1!L$8=0,0,(ROUND(((BF11*10)/PARCIAL2!L$8),1)))","v":10},null,null,2,2,2,2,2,2,2,2,2,2,2,2,2,2,2,2,2,2,2,2,2,2,2,2,2,2,2,0,0,0,0,0,0,0,0,0,0,0,0,0,0,0,0,0,0,0,0,0,0,0,0,0,{"$f":"IF(#REF!>$Y$3,0,#REF!)","v":{"$error":"#REF!"}},{"$f":"IF(#REF!>$Y$3,0,#REF!)","v":{"$error":"#REF!"}},{"$f":"IF(#REF!>$Y$3,0,#REF!)","v":{"$error":"#REF!"}},{"$f":"IF(#REF!>$Y$3,0,#REF!)","v":{"$error":"#REF!"}},{"$f":"IF(#REF!>$Y$3,0,#REF!)","v":{"$error":"#REF!"}},{"$f":"IF(#REF!>$Y$3,0,#REF!)","v":{"$error":"#REF!"}},{"$f":"IF(#REF!>$Y$3,0,#REF!)","v":{"$error":"#REF!"}},{"$f":"IF(#REF!>$Y$3,0,#REF!)","v":{"$error":"#REF!"}},{"$f":"IF(#REF!>$Y$3,0,#REF!)","v":{"$error":"#REF!"}},{"$f":"IF(#REF!>$Y$3,0,#REF!)","v":{"$error":"#REF!"}},{"$f":"IF(#REF!>$Y$3,0,#REF!)","v":{"$error":"#REF!"}},{"$f":"IF(#REF!>$Y$3,0,#REF!)","v":{"$error":"#REF!"}},{"$f":"IF(#REF!>$Y$3,0,#REF!)","v":{"$error":"#REF!"}},{"$f":"IF(#REF!>$Y$3,0,#REF!)","v":{"$error":"#REF!"}},{"$f":"IF(#REF!>$Y$3,0,#REF!)","v":{"$error":"#REF!"}},{"$f":"IF(#REF!>$Y$3,0,#REF!)","v":{"$error":"#REF!"}},{"$f":"IF(#REF!>$Y$3,0,#REF!)","v":{"$error":"#REF!"}},{"$f":"IF(#REF!>$Y$3,0,#REF!)","v":{"$error":"#REF!"}},{"$f":"IF(#REF!>$Y$3,0,#REF!)","v":{"$error":"#REF!"}},{"$f":"IF(#REF!>$Y$3,0,#REF!)","v":{"$error":"#REF!"}},{"$f":"IF(#REF!>$Y$3,0,#REF!)","v":{"$error":"#REF!"}},{"$f":"IF(#REF!>$Y$3,0,#REF!)","v":{"$error":"#REF!"}},{"$f":"IF(#REF!>$Y$3,0,#REF!)","v":{"$error":"#REF!"}},{"$f":"IF(#REF!>$Y$3,0,#REF!)","v":{"$error":"#REF!"}},{"$f":"IF(#REF!>$Y$3,0,#REF!)","v":{"$error":"#REF!"}},{"$f":"IF(#REF!>$Y$3,0,#REF!)","v":{"$error":"#REF!"}},{"$f":"IF(#REF!>$Y$3,0,#REF!)","v":{"$error":"#REF!"}},{"$f":"IF(#REF!>$Y$3,0,#REF!)","v":{"$error":"#REF!"}}]
[null,null,8,{"$f":"IF('AS1'!D12=\"\",\"\",'AS1'!D12)","v":""},{"$f":"IF('AS1'!E12=\"\",\"\",'AS1'!E12)","v":"VALLEJO ORDOÑEZ SAYONARA ELIZABETH"},2,2,2,null,2,2,2,2,2,2,2,2,2,2,2,2,2,2,2,2,2,2,2,2,2,2,2,null,null,null,null,null,null,null,null,null,null,null,null,null,null,null,null,null,null,null,null,null,null,null,null,null,52,{"$f":"IF(PARCIAL1!L$8=0,0,(ROUND(((BF12*10)/PARCIAL2!L$8),1)))","v":9.6},null,null,2,2,2,0,2,2,2,2,2,2,2,2,2,2,2,2,2,2,2,2,2,2,2,2,2,2,2,0,0,0,0,0,0,0,0,0,0,0,0,0,0,0,0,0,0,0,0,0,0,0,0,0,{"$f":"IF(#REF!>$Y$3,0,#REF!)","v":{"$error":"#REF!"}},{"$f":"IF(#REF!>$Y$3,0,#REF!)","v":{"$error":"#REF!"}},{"$f":"IF(#REF!>$Y$3,0,#REF!)","v":{"$error":"#REF!"}},{"$f":"IF(#REF!>$Y$3,0,#REF!)","v":{"$error":"#REF!"}},{"$f":"IF(#REF!>$Y$3,0,#REF!)","v":{"$error":"#REF!"}},{"$f":"IF(#REF!>$Y$3,0,#REF!)","v":{"$error":"#REF!"}},{"$f":"IF(#REF!>$Y$3,0,#REF!)","v":{"$error":"#REF!"}},{"$f":"IF(#REF!>$Y$3,0,#REF!)","v":{"$error":"#REF!"}},{"$f":"IF(#REF!>$Y$3,0,#REF!)","v":{"$error":"#REF!"}},{"$f":"IF(#REF!>$Y$3,0,#REF!)","v":{"$error":"#REF!"}},{"$f":"IF(#REF!>$Y$3,0,#REF!)","v":{"$error":"#REF!"}},{"$f":"IF(#REF!>$Y$3,0,#REF!)","v":{"$error":"#REF!"}},{"$f":"IF(#REF!>$Y$3,0,#REF!)","v":{"$error":"#REF!"}},{"$f":"IF(#REF!>$Y$3,0,#REF!)","v":{"$error":"#REF!"}},{"$f":"IF(#REF!>$Y$3,0,#REF!)","v":{"$error":"#REF!"}},{"$f":"IF(#REF!>$Y$3,0,#REF!)","v":{"$error":"#REF!"}},{"$f":"IF(#REF!>$Y$3,0,#REF!)","v":{"$error":"#REF!"}},{"$f":"IF(#REF!>$Y$3,0,#REF!)","v":{"$error":"#REF!"}},{"$f":"IF(#REF!>$Y$3,0,#REF!)","v":{"$error":"#REF!"}},{"$f":"IF(#REF!>$Y$3,0,#REF!)","v":{"$error":"#REF!"}},{"$f":"IF(#REF!>$Y$3,0,#REF!)","v":{"$error":"#REF!"}},{"$f":"IF(#REF!>$Y$3,0,#REF!)","v":{"$error":"#REF!"}},{"$f":"IF(#REF!>$Y$3,0,#REF!)","v":{"$error":"#REF!"}},{"$f":"IF(#REF!>$Y$3,0,#REF!)","v":{"$error":"#REF!"}},{"$f":"IF(#REF!>$Y$3,0,#REF!)","v":{"$error":"#REF!"}},{"$f":"IF(#REF!>$Y$3,0,#REF!)","v":{"$error":"#REF!"}},{"$f":"IF(#REF!>$Y$3,0,#REF!)","v":{"$error":"#REF!"}},{"$f":"IF(#REF!>$Y$3,0,#REF!)","v":{"$error":"#REF!"}}]
[null,null,9,{"$f":"IF('AS1'!D13=\"\",\"\",'AS1'!D13)","v":""},{"$f":"IF('AS1'!E13=\"\",\"\",'AS1'!E13)","v":""},null,null,null,null,null,null,null,null,null,null,null,null,null,null,null,null,null,null,null,null,null,null,null,null,null,null,null,null,null,null,null,null,null,null,null,null,null,null,null,null,null,null,null,null,null,null,null,null,null,null,null,null,0,{"$f":"IF(PARCIAL1!L$8=0,0,(ROUND(((BF13*10)/PARCIAL2!L$8),1)))","v":0},null,null,0,0,0,0,0,0,0,0,0,0,0,0,0,0,0,0,0,0,0,0,0,0,0,0,0,0,0,0,0,0,0,0,0,0,0,0,0,0,0,0,0,0,0,0,0,0,0,0,0,0,0,0,{"$f":"IF(#REF!>$Y$3,0,#REF!)","v":{"$error":"#REF!"}},{"$f":"IF(#REF!>$Y$3,0,#REF!)","v":{"$error":"#REF!"}},{"$f":"IF(#REF!>$Y$3,0,#REF!)","v":{"$error":"#REF!"}},{"$f":"IF(#REF!>$Y$3,0,#REF!)","v":{"$error":"#REF!"}},{"$f":"IF(#REF!>$Y$3,0,#REF!)","v":{"$error":"#REF!"}},{"$f":"IF(#REF!>$Y$3,0,#REF!)","v":{"$error":"#REF!"}},{"$f":"IF(#REF!>$Y$3,0,#REF!)","v":{"$error":"#REF!"}},{"$f":"IF(#REF!>$Y$3,0,#REF!)","v":{"$error":"#REF!"}},{"$f":"IF(#REF!>$Y$3,0,#REF!)","v":{"$error":"#REF!"}},{"$f":"IF(#REF!>$Y$3,0,#REF!)","v":{"$error":"#REF!"}},{"$f":"IF(#REF!>$Y$3,0,#REF!)","v":{"$error":"#REF!"}},{"$f":"IF(#REF!>$Y$3,0,#REF!)","v":{"$error":"#REF!"}},{"$f":"IF(#REF!>$Y$3,0,#REF!)","v":{"$error":"#REF!"}},{"$f":"IF(#REF!>$Y$3,0,#REF!)","v":{"$error":"#REF!"}},{"$f":"IF(#REF!>$Y$3,0,#REF!)","v":{"$error":"#REF!"}},{"$f":"IF(#REF!>$Y$3,0,#REF!)","v":{"$error":"#REF!"}},{"$f":"IF(#REF!>$Y$3,0,#REF!)","v":{"$error":"#REF!"}},{"$f":"IF(#REF!>$Y$3,0,#REF!)","v":{"$error":"#REF!"}},{"$f":"IF(#REF!>$Y$3,0,#REF!)","v":{"$error":"#REF!"}},{"$f":"IF(#REF!>$Y$3,0,#REF!)","v":{"$error":"#REF!"}},{"$f":"IF(#REF!>$Y$3,0,#REF!)","v":{"$error":"#REF!"}},{"$f":"IF(#REF!>$Y$3,0,#REF!)","v":{"$error":"#REF!"}},{"$f":"IF(#REF!>$Y$3,0,#REF!)","v":{"$error":"#REF!"}},{"$f":"IF(#REF!>$Y$3,0,#REF!)","v":{"$error":"#REF!"}},{"$f":"IF(#REF!>$Y$3,0,#REF!)","v":{"$error":"#REF!"}},{"$f":"IF(#REF!>$Y$3,0,#REF!)","v":{"$error":"#REF!"}},{"$f":"IF(#REF!>$Y$3,0,#REF!)","v":{"$error":"#REF!"}},{"$f":"IF(#REF!>$Y$3,0,#REF!)","v":{"$error":"#REF!"}}]
[null,null,10,{"$f":"IF('AS1'!D14=\"\",\"\",'AS1'!D14)","v":""},{"$f":"IF('AS1'!E14=\"\",\"\",'AS1'!E14)","v":""},null,null,null,null,null,null,null,null,null,null,null,null,null,null,null,null,null,null,null,null,null,null,null,null,null,null,null,null,null,null,null,null,null,null,null,null,null,null,null,null,null,null,null,null,null,null,null,null,null,null,null,null,0,{"$f":"IF(PARCIAL1!L$8=0,0,(ROUND(((BF14*10)/PARCIAL2!L$8),1)))","v":0},null,null,0,0,0,0,0,0,0,0,0,0,0,0,0,0,0,0,0,0,0,0,0,0,0,0,0,0,0,0,0,0,0,0,0,0,0,0,0,0,0,0,0,0,0,0,0,0,0,0,0,0,0,0,{"$f":"IF(#REF!>$Y$3,0,#REF!)","v":{"$error":"#REF!"}},{"$f":"IF(#REF!>$Y$3,0,#REF!)","v":{"$error":"#REF!"}},{"$f":"IF(#REF!>$Y$3,0,#REF!)","v":{"$error":"#REF!"}},{"$f":"IF(#REF!>$Y$3,0,#REF!)","v":{"$error":"#REF!"}},{"$f":"IF(#REF!>$Y$3,0,#REF!)","v":{"$error":"#REF!"}},{"$f":"IF(#REF!>$Y$3,0,#REF!)","v":{"$error":"#REF!"}},{"$f":"IF(#REF!>$Y$3,0,#REF!)","v":{"$error":"#REF!"}},{"$f":"IF(#REF!>$Y$3,0,#REF!)","v":{"$error":"#REF!"}},{"$f":"IF(#REF!>$Y$3,0,#REF!)","v":{"$error":"#REF!"}},{"$f":"IF(#REF!>$Y$3,0,#REF!)","v":{"$error":"#REF!"}},{"$f":"IF(#REF!>$Y$3,0,#REF!)","v":{"$error":"#REF!"}},{"$f":"IF(#REF!>$Y$3,0,#REF!)","v":{"$error":"#REF!"}},{"$f":"IF(#REF!>$Y$3,0,#REF!)","v":{"$error":"#REF!"}},{"$f":"IF(#REF!>$Y$3,0,#REF!)","v":{"$error":"#REF!"}},{"$f":"IF(#REF!>$Y$3,0,#REF!)","v":{"$error":"#REF!"}},{"$f":"IF(#REF!>$Y$3,0,#REF!)","v":{"$error":"#REF!"}},{"$f":"IF(#REF!>$Y$3,0,#REF!)","v":{"$error":"#REF!"}},{"$f":"IF(#REF!>$Y$3,0,#REF!)","v":{"$error":"#REF!"}},{"$f":"IF(#REF!>$Y$3,0,#REF!)","v":{"$error":"#REF!"}},{"$f":"IF(#REF!>$Y$3,0,#REF!)","v":{"$error":"#REF!"}},{"$f":"IF(#REF!>$Y$3,0,#REF!)","v":{"$error":"#REF!"}},{"$f":"IF(#REF!>$Y$3,0,#REF!)","v":{"$error":"#REF!"}},{"$f":"IF(#REF!>$Y$3,0,#REF!)","v":{"$error":"#REF!"}},{"$f":"IF(#REF!>$Y$3,0,#REF!)","v":{"$error":"#REF!"}},{"$f":"IF(#REF!>$Y$3,0,#REF!)","v":{"$error":"#REF!"}},{"$f":"IF(#REF!>$Y$3,0,#REF!)","v":{"$error":"#REF!"}},{"$f":"IF(#REF!>$Y$3,0,#REF!)","v":{"$error":"#REF!"}},{"$f":"IF(#REF!>$Y$3,0,#REF!)","v":{"$error":"#REF!"}}]
[null,null,11,{"$f":"IF('AS1'!D15=\"\",\"\",'AS1'!D15)","v":""},{"$f":"IF('AS1'!E15=\"\",\"\",'AS1'!E15)","v":""},null,null,null,null,null,null,null,null,null,null,null,null,null,null,null,null,null,null,null,null,null,null,null,null,null,null,null,null,null,null,null,null,null,null,null,null,null,null,null,null,null,null,null,null,null,null,null,null,null,null,null,null,0,{"$f":"IF(PARCIAL1!L$8=0,0,(ROUND(((BF15*10)/PARCIAL2!L$8),1)))","v":0},null,null,0,0,0,0,0,0,0,0,0,0,0,0,0,0,0,0,0,0,0,0,0,0,0,0,0,0,0,0,0,0,0,0,0,0,0,0,0,0,0,0,0,0,0,0,0,0,0,0,0,0,0,0,{"$f":"IF(#REF!>$Y$3,0,#REF!)","v":{"$error":"#REF!"}},{"$f":"IF(#REF!>$Y$3,0,#REF!)","v":{"$error":"#REF!"}},{"$f":"IF(#REF!>$Y$3,0,#REF!)","v":{"$error":"#REF!"}},{"$f":"IF(#REF!>$Y$3,0,#REF!)","v":{"$error":"#REF!"}},{"$f":"IF(#REF!>$Y$3,0,#REF!)","v":{"$error":"#REF!"}},{"$f":"IF(#REF!>$Y$3,0,#REF!)","v":{"$error":"#REF!"}},{"$f":"IF(#REF!>$Y$3,0,#REF!)","v":{"$error":"#REF!"}},{"$f":"IF(#REF!>$Y$3,0,#REF!)","v":{"$error":"#REF!"}},{"$f":"IF(#REF!>$Y$3,0,#REF!)","v":{"$error":"#REF!"}},{"$f":"IF(#REF!>$Y$3,0,#REF!)","v":{"$error":"#REF!"}},{"$f":"IF(#REF!>$Y$3,0,#REF!)","v":{"$error":"#REF!"}},{"$f":"IF(#REF!>$Y$3,0,#REF!)","v":{"$error":"#REF!"}},{"$f":"IF(#REF!>$Y$3,0,#REF!)","v":{"$error":"#REF!"}},{"$f":"IF(#REF!>$Y$3,0,#REF!)","v":{"$error":"#REF!"}},{"$f":"IF(#REF!>$Y$3,0,#REF!)","v":{"$error":"#REF!"}},{"$f":"IF(#REF!>$Y$3,0,#REF!)","v":{"$error":"#REF!"}},{"$f":"IF(#REF!>$Y$3,0,#REF!)","v":{"$error":"#REF!"}},{"$f":"IF(#REF!>$Y$3,0,#REF!)","v":{"$error":"#REF!"}},{"$f":"IF(#REF!>$Y$3,0,#REF!)","v":{"$error":"#REF!"}},{"$f":"IF(#REF!>$Y$3,0,#REF!)","v":{"$error":"#REF!"}},{"$f":"IF(#REF!>$Y$3,0,#REF!)","v":{"$error":"#REF!"}},{"$f":"IF(#REF!>$Y$3,0,#REF!)","v":{"$error":"#REF!"}},{"$f":"IF(#REF!>$Y$3,0,#REF!)","v":{"$error":"#REF!"}},{"$f":"IF(#REF!>$Y$3,0,#REF!)","v":{"$error":"#REF!"}},{"$f":"IF(#REF!>$Y$3,0,#REF!)","v":{"$error":"#REF!"}},{"$f":"IF(#REF!>$Y$3,0,#REF!)","v":{"$error":"#REF!"}},{"$f":"IF(#REF!>$Y$3,0,#REF!)","v":{"$error":"#REF!"}},{"$f":"IF(#REF!>$Y$3,0,#REF!)","v":{"$error":"#REF!"}}]
[null,null,12,{"$f":"IF('AS1'!D16=\"\",\"\",'AS1'!D16)","v":""},{"$f":"IF('AS1'!E16=\"\",\"\",'AS1'!E16)","v":""},null,null,null,null,null,null,null,null,null,null,null,null,null,null,null,null,null,null,null,null,null,null,null,null,null,null,null,null,null,null,null,null,null,null,null,null,null,null,null,null,null,null,null,null,null,null,null,null,null,null,null,null,0,{"$f":"IF(PARCIAL1!L$8=0,0,(ROUND(((BF16*10)/PARCIAL2!L$8),1)))","v":0},null,null,0,0,0,0,0,0,0,0,0,0,0,0,0,0,0,0,0,0,0,0,0,0,0,0,0,0,0,0,0,0,0,0,0,0,0,0,0,0,0,0,0,0,0,0,0,0,0,0,0,0,0,0,{"$f":"IF(#REF!>$Y$3,0,#REF!)","v":{"$error":"#REF!"}},{"$f":"IF(#REF!>$Y$3,0,#REF!)","v":{"$error":"#REF!"}},{"$f":"IF(#REF!>$Y$3,0,#REF!)","v":{"$error":"#REF!"}},{"$f":"IF(#REF!>$Y$3,0,#REF!)","v":{"$error":"#REF!"}},{"$f":"IF(#REF!>$Y$3,0,#REF!)","v":{"$error":"#REF!"}},{"$f":"IF(#REF!>$Y$3,0,#REF!)","v":{"$error":"#REF!"}},{"$f":"IF(#REF!>$Y$3,0,#REF!)","v":{"$error":"#REF!"}},{"$f":"IF(#REF!>$Y$3,0,#REF!)","v":{"$error":"#REF!"}},{"$f":"IF(#REF!>$Y$3,0,#REF!)","v":{"$error":"#REF!"}},{"$f":"IF(#REF!>$Y$3,0,#REF!)","v":{"$error":"#REF!"}},{"$f":"IF(#REF!>$Y$3,0,#REF!)","v":{"$error":"#REF!"}},{"$f":"IF(#REF!>$Y$3,0,#REF!)","v":{"$error":"#REF!"}},{"$f":"IF(#REF!>$Y$3,0,#REF!)","v":{"$error":"#REF!"}},{"$f":"IF(#REF!>$Y$3,0,#REF!)","v":{"$error":"#REF!"}},{"$f":"IF(#REF!>$Y$3,0,#REF!)","v":{"$error":"#REF!"}},{"$f":"IF(#REF!>$Y$3,0,#REF!)","v":{"$error":"#REF!"}},{"$f":"IF(#REF!>$Y$3,0,#REF!)","v":{"$error":"#REF!"}},{"$f":"IF(#REF!>$Y$3,0,#REF!)","v":{"$error":"#REF!"}},{"$f":"IF(#REF!>$Y$3,0,#REF!)","v":{"$error":"#REF!"}},{"$f":"IF(#REF!>$Y$3,0,#REF!)","v":{"$error":"#REF!"}},{"$f":"IF(#REF!>$Y$3,0,#REF!)","v":{"$error":"#REF!"}},{"$f":"IF(#REF!>$Y$3,0,#REF!)","v":{"$error":"#REF!"}},{"$f":"IF(#REF!>$Y$3,0,#REF!)","v":{"$error":"#REF!"}},{"$f":"IF(#REF!>$Y$3,0,#REF!)","v":{"$error":"#REF!"}},{"$f":"IF(#REF!>$Y$3,0,#REF!)","v":{"$error":"#REF!"}},{"$f":"IF(#REF!>$Y$3,0,#REF!)","v":{"$error":"#REF!"}},{"$f":"IF(#REF!>$Y$3,0,#REF!)","v":{"$error":"#REF!"}},{"$f":"IF(#REF!>$Y$3,0,#REF!)","v":{"$error":"#REF!"}}]
[null,null,13,{"$f":"IF('AS1'!D17=\"\",\"\",'AS1'!D17)","v":""},{"$f":"IF('AS1'!E17=\"\",\"\",'AS1'!E17)","v":""},null,null,null,null,null,null,null,null,null,null,null,null,null,null,null,null,null,null,null,null,null,null,null,null,null,null,null,null,null,null,null,null,null,null,null,null,null,null,null,null,null,null,null,null,null,null,null,null,null,null,null,null,0,{"$f":"IF(PARCIAL1!L$8=0,0,(ROUND(((BF17*10)/PARCIAL2!L$8),1)))","v":0},null,null,0,0,0,0,0,0,0,0,0,0,0,0,0,0,0,0,0,0,0,0,0,0,0,0,0,0,0,0,0,0,0,0,0,0,0,0,0,0,0,0,0,0,0,0,0,0,0,0,0,0,0,0,{"$f":"IF(#REF!>$Y$3,0,#REF!)","v":{"$error":"#REF!"}},{"$f":"IF(#REF!>$Y$3,0,#REF!)","v":{"$error":"#REF!"}},{"$f":"IF(#REF!>$Y$3,0,#REF!)","v":{"$error":"#REF!"}},{"$f":"IF(#REF!>$Y$3,0,#REF!)","v":{"$error":"#REF!"}},{"$f":"IF(#REF!>$Y$3,0,#REF!)","v":{"$error":"#REF!"}},{"$f":"IF(#REF!>$Y$3,0,#REF!)","v":{"$error":"#REF!"}},{"$f":"IF(#REF!>$Y$3,0,#REF!)","v":{"$error":"#REF!"}},{"$f":"IF(#REF!>$Y$3,0,#REF!)","v":{"$error":"#REF!"}},{"$f":"IF(#REF!>$Y$3,0,#REF!)","v":{"$error":"#REF!"}},{"$f":"IF(#REF!>$Y$3,0,#REF!)","v":{"$error":"#REF!"}},{"$f":"IF(#REF!>$Y$3,0,#REF!)","v":{"$error":"#REF!"}},{"$f":"IF(#REF!>$Y$3,0,#REF!)","v":{"$error":"#REF!"}},{"$f":"IF(#REF!>$Y$3,0,#REF!)","v":{"$error":"#REF!"}},{"$f":"IF(#REF!>$Y$3,0,#REF!)","v":{"$error":"#REF!"}},{"$f":"IF(#REF!>$Y$3,0,#REF!)","v":{"$error":"#REF!"}},{"$f":"IF(#REF!>$Y$3,0,#REF!)","v":{"$error":"#REF!"}},{"$f":"IF(#REF!>$Y$3,0,#REF!)","v":{"$error":"#REF!"}},{"$f":"IF(#REF!>$Y$3,0,#REF!)","v":{"$error":"#REF!"}},{"$f":"IF(#REF!>$Y$3,0,#REF!)","v":{"$error":"#REF!"}},{"$f":"IF(#REF!>$Y$3,0,#REF!)","v":{"$error":"#REF!"}},{"$f":"IF(#REF!>$Y$3,0,#REF!)","v":{"$error":"#REF!"}},{"$f":"IF(#REF!>$Y$3,0,#REF!)","v":{"$error":"#REF!"}},{"$f":"IF(#REF!>$Y$3,0,#REF!)","v":{"$error":"#REF!"}},{"$f":"IF(#REF!>$Y$3,0,#REF!)","v":{"$error":"#REF!"}},{"$f":"IF(#REF!>$Y$3,0,#REF!)","v":{"$error":"#REF!"}},{"$f":"IF(#REF!>$Y$3,0,#REF!)","v":{"$error":"#REF!"}},{"$f":"IF(#REF!>$Y$3,0,#REF!)","v":{"$error":"#REF!"}},{"$f":"IF(#REF!>$Y$3,0,#REF!)","v":{"$error":"#REF!"}}]
[null,null,14,{"$f":"IF('AS1'!D18=\"\",\"\",'AS1'!D18)","v":""},{"$f":"IF('AS1'!E18=\"\",\"\",'AS1'!E18)","v":""},null,null,null,null,null,null,null,null,null,null,null,null,null,null,null,null,null,null,null,null,null,null,null,null,null,null,null,null,null,null,null,null,null,null,null,null,null,null,null,null,null,null,null,null,null,null,null,null,null,null,null,null,0,{"$f":"IF(PARCIAL1!L$8=0,0,(ROUND(((BF18*10)/PARCIAL2!L$8),1)))","v":0},null,null,0,0,0,0,0,0,0,0,0,0,0,0,0,0,0,0,0,0,0,0,0,0,0,0,0,0,0,0,0,0,0,0,0,0,0,0,0,0,0,0,0,0,0,0,0,0,0,0,0,0,0,0,{"$f":"IF(#REF!>$Y$3,0,#REF!)","v":{"$error":"#REF!"}},{"$f":"IF(#REF!>$Y$3,0,#REF!)","v":{"$error":"#REF!"}},{"$f":"IF(#REF!>$Y$3,0,#REF!)","v":{"$error":"#REF!"}},{"$f":"IF(#REF!>$Y$3,0,#REF!)","v":{"$error":"#REF!"}},{"$f":"IF(#REF!>$Y$3,0,#REF!)","v":{"$error":"#REF!"}},{"$f":"IF(#REF!>$Y$3,0,#REF!)","v":{"$error":"#REF!"}},{"$f":"IF(#REF!>$Y$3,0,#REF!)","v":{"$error":"#REF!"}},{"$f":"IF(#REF!>$Y$3,0,#REF!)","v":{"$error":"#REF!"}},{"$f":"IF(#REF!>$Y$3,0,#REF!)","v":{"$error":"#REF!"}},{"$f":"IF(#REF!>$Y$3,0,#REF!)","v":{"$error":"#REF!"}},{"$f":"IF(#REF!>$Y$3,0,#REF!)","v":{"$error":"#REF!"}},{"$f":"IF(#REF!>$Y$3,0,#REF!)","v":{"$error":"#REF!"}},{"$f":"IF(#REF!>$Y$3,0,#REF!)","v":{"$error":"#REF!"}},{"$f":"IF(#REF!>$Y$3,0,#REF!)","v":{"$error":"#REF!"}},{"$f":"IF(#REF!>$Y$3,0,#REF!)","v":{"$error":"#REF!"}},{"$f":"IF(#REF!>$Y$3,0,#REF!)","v":{"$error":"#REF!"}},{"$f":"IF(#REF!>$Y$3,0,#REF!)","v":{"$error":"#REF!"}},{"$f":"IF(#REF!>$Y$3,0,#REF!)","v":{"$error":"#REF!"}},{"$f":"IF(#REF!>$Y$3,0,#REF!)","v":{"$error":"#REF!"}},{"$f":"IF(#REF!>$Y$3,0,#REF!)","v":{"$error":"#REF!"}},{"$f":"IF(#REF!>$Y$3,0,#REF!)","v":{"$error":"#REF!"}},{"$f":"IF(#REF!>$Y$3,0,#REF!)","v":{"$error":"#REF!"}},{"$f":"IF(#REF!>$Y$3,0,#REF!)","v":{"$error":"#REF!"}},{"$f":"IF(#REF!>$Y$3,0,#REF!)","v":{"$error":"#REF!"}},{"$f":"IF(#REF!>$Y$3,0,#REF!)","v":{"$error":"#REF!"}},{"$f":"IF(#REF!>$Y$3,0,#REF!)","v":{"$error":"#REF!"}},{"$f":"IF(#REF!>$Y$3,0,#REF!)","v":{"$error":"#REF!"}},{"$f":"IF(#REF!>$Y$3,0,#REF!)","v":{"$error":"#REF!"}}]
[null,null,15,{"$f":"IF('AS1'!D19=\"\",\"\",'AS1'!D19)","v":""},{"$f":"IF('AS1'!E19=\"\",\"\",'AS1'!E19)","v":""},null,null,null,null,null,null,null,null,null,null,null,null,null,null,null,null,null,null,null,null,null,null,null,null,null,null,null,null,null,null,null,null,null,null,null,null,null,null,null,null,null,null,null,null,null,null,null,null,null,null,null,null,0,{"$f":"IF(PARCIAL1!L$8=0,0,(ROUND(((BF19*10)/PARCIAL2!L$8),1)))","v":0},null,null,0,0,0,0,0,0,0,0,0,0,0,0,0,0,0,0,0,0,0,0,0,0,0,0,0,0,0,0,0,0,0,0,0,0,0,0,0,0,0,0,0,0,0,0,0,0,0,0,0,0,0,0,{"$f":"IF(#REF!>$Y$3,0,#REF!)","v":{"$error":"#REF!"}},{"$f":"IF(#REF!>$Y$3,0,#REF!)","v":{"$error":"#REF!"}},{"$f":"IF(#REF!>$Y$3,0,#REF!)","v":{"$error":"#REF!"}},{"$f":"IF(#REF!>$Y$3,0,#REF!)","v":{"$error":"#REF!"}},{"$f":"IF(#REF!>$Y$3,0,#REF!)","v":{"$error":"#REF!"}},{"$f":"IF(#REF!>$Y$3,0,#REF!)","v":{"$error":"#REF!"}},{"$f":"IF(#REF!>$Y$3,0,#REF!)","v":{"$error":"#REF!"}},{"$f":"IF(#REF!>$Y$3,0,#REF!)","v":{"$error":"#REF!"}},{"$f":"IF(#REF!>$Y$3,0,#REF!)","v":{"$error":"#REF!"}},{"$f":"IF(#REF!>$Y$3,0,#REF!)","v":{"$error":"#REF!"}},{"$f":"IF(#REF!>$Y$3,0,#REF!)","v":{"$error":"#REF!"}},{"$f":"IF(#REF!>$Y$3,0,#REF!)","v":{"$error":"#REF!"}},{"$f":"IF(#REF!>$Y$3,0,#REF!)","v":{"$error":"#REF!"}},{"$f":"IF(#REF!>$Y$3,0,#REF!)","v":{"$error":"#REF!"}},{"$f":"IF(#REF!>$Y$3,0,#REF!)","v":{"$error":"#REF!"}},{"$f":"IF(#REF!>$Y$3,0,#REF!)","v":{"$error":"#REF!"}},{"$f":"IF(#REF!>$Y$3,0,#REF!)","v":{"$error":"#REF!"}},{"$f":"IF(#REF!>$Y$3,0,#REF!)","v":{"$error":"#REF!"}},{"$f":"IF(#REF!>$Y$3,0,#REF!)","v":{"$error":"#REF!"}},{"$f":"IF(#REF!>$Y$3,0,#REF!)","v":{"$error":"#REF!"}},{"$f":"IF(#REF!>$Y$3,0,#REF!)","v":{"$error":"#REF!"}},{"$f":"IF(#REF!>$Y$3,0,#REF!)","v":{"$error":"#REF!"}},{"$f":"IF(#REF!>$Y$3,0,#REF!)","v":{"$error":"#REF!"}},{"$f":"IF(#REF!>$Y$3,0,#REF!)","v":{"$error":"#REF!"}},{"$f":"IF(#REF!>$Y$3,0,#REF!)","v":{"$error":"#REF!"}},{"$f":"IF(#REF!>$Y$3,0,#REF!)","v":{"$error":"#REF!"}},{"$f":"IF(#REF!>$Y$3,0,#REF!)","v":{"$error":"#REF!"}},{"$f":"IF(#REF!>$Y$3,0,#REF!)","v":{"$error":"#REF!"}}]
[null,null,16,{"$f":"IF('AS1'!D20=\"\",\"\",'AS1'!D20)","v":""},{"$f":"IF('AS1'!E20=\"\",\"\",'AS1'!E20)","v":""},null,null,null,null,null,null,null,null,null,null,null,null,null,null,null,null,null,null,null,null,null,null,null,null,null,null,null,null,null,null,null,null,null,null,null,null,null,null,null,null,null,null,null,null,null,null,null,null,null,null,null,null,0,{"$f":"IF(PARCIAL1!L$8=0,0,(ROUND(((BF20*10)/PARCIAL2!L$8),1)))","v":0},null,null,0,0,0,0,0,0,0,0,0,0,0,0,0,0,0,0,0,0,0,0,0,0,0,0,0,0,0,0,0,0,{"$f":"IF(AJ20>$Y$3,0,AJ20)","v":0},0,0,0,0,0,0,0,0,0,0,0,0,0,0,0,0,0,0,0,0,0,{"$f":"IF(#REF!>$Y$3,0,#REF!)","v":{"$error":"#REF!"}},{"$f":"IF(#REF!>$Y$3,0,#REF!)","v":{"$error":"#REF!"}},{"$f":"IF(#REF!>$Y$3,0,#REF!)","v":{"$error":"#REF!"}},{"$f":"IF(#REF!>$Y$3,0,#REF!)","v":{"$error":"#REF!"}},{"$f":"IF(#REF!>$Y$3,0,#REF!)","v":{"$error":"#REF!"}},{"$f":"IF(#REF!>$Y$3,0,#REF!)","v":{"$error":"#REF!"}},{"$f":"IF(#REF!>$Y$3,0,#REF!)","v":{"$error":"#REF!"}},{"$f":"IF(#REF!>$Y$3,0,#REF!)","v":{"$error":"#REF!"}},{"$f":"IF(#REF!>$Y$3,0,#REF!)","v":{"$error":"#REF!"}},{"$f":"IF(#REF!>$Y$3,0,#REF!)","v":{"$error":"#REF!"}},{"$f":"IF(#REF!>$Y$3,0,#REF!)","v":{"$error":"#REF!"}},{"$f":"IF(#REF!>$Y$3,0,#REF!)","v":{"$error":"#REF!"}},{"$f":"IF(#REF!>$Y$3,0,#REF!)","v":{"$error":"#REF!"}},{"$f":"IF(#REF!>$Y$3,0,#REF!)","v":{"$error":"#REF!"}},{"$f":"IF(#REF!>$Y$3,0,#REF!)","v":{"$error":"#REF!"}},{"$f":"IF(#REF!>$Y$3,0,#REF!)","v":{"$error":"#REF!"}},{"$f":"IF(#REF!>$Y$3,0,#REF!)","v":{"$error":"#REF!"}},{"$f":"IF(#REF!>$Y$3,0,#REF!)","v":{"$error":"#REF!"}},{"$f":"IF(#REF!>$Y$3,0,#REF!)","v":{"$error":"#REF!"}},{"$f":"IF(#REF!>$Y$3,0,#REF!)","v":{"$error":"#REF!"}},{"$f":"IF(#REF!>$Y$3,0,#REF!)","v":{"$error":"#REF!"}},{"$f":"IF(#REF!>$Y$3,0,#REF!)","v":{"$error":"#REF!"}},{"$f":"IF(#REF!>$Y$3,0,#REF!)","v":{"$error":"#REF!"}},{"$f":"IF(#REF!>$Y$3,0,#REF!)","v":{"$error":"#REF!"}},{"$f":"IF(#REF!>$Y$3,0,#REF!)","v":{"$error":"#REF!"}},{"$f":"IF(#REF!>$Y$3,0,#REF!)","v":{"$error":"#REF!"}},{"$f":"IF(#REF!>$Y$3,0,#REF!)","v":{"$error":"#REF!"}},{"$f":"IF(#REF!>$Y$3,0,#REF!)","v":{"$error":"#REF!"}}]
[null,null,17,{"$f":"IF('AS1'!D21=\"\",\"\",'AS1'!D21)","v":""},{"$f":"IF('AS1'!E21=\"\",\"\",'AS1'!E21)","v":""},null,null,null,null,null,null,null,null,null,null,null,null,null,null,null,null,null,null,null,null,null,null,null,null,null,null,null,null,null,null,null,null,null,null,null,null,null,null,null,null,null,null,null,null,null,null,null,null,null,null,null,null,0,{"$f":"IF(PARCIAL1!L$8=0,0,(ROUND(((BF21*10)/PARCIAL2!L$8),1)))","v":0},null,null,{"$f":"IF(F21>$Y$3,0,F21)","v":0},0,0,0,0,0,0,0,0,0,0,0,0,0,0,0,{"$f":"IF(V21>$Y$3,0,V21)","v":0},0,0,0,0,0,0,0,0,0,0,0,0,0,0,0,0,0,0,0,0,0,0,0,0,0,0,0,0,0,{"$f":"IF(AZ21>$Y$3,0,AZ21)","v":0},0,0,0,0,0,{"$f":"IF(#REF!>$Y$3,0,#REF!)","v":{"$error":"#REF!"}},{"$f":"IF(#REF!>$Y$3,0,#REF!)","v":{"$error":"#REF!"}},{"$f":"IF(#REF!>$Y$3,0,#REF!)","v":{"$error":"#REF!"}},{"$f":"IF(#REF!>$Y$3,0,#REF!)","v":{"$error":"#REF!"}},{"$f":"IF(#REF!>$Y$3,0,#REF!)","v":{"$error":"#REF!"}},{"$f":"IF(#REF!>$Y$3,0,#REF!)","v":{"$error":"#REF!"}},{"$f":"IF(#REF!>$Y$3,0,#REF!)","v":{"$error":"#REF!"}},{"$f":"IF(#REF!>$Y$3,0,#REF!)","v":{"$error":"#REF!"}},{"$f":"IF(#REF!>$Y$3,0,#REF!)","v":{"$error":"#REF!"}},{"$f":"IF(#REF!>$Y$3,0,#REF!)","v":{"$error":"#REF!"}},{"$f":"IF(#REF!>$Y$3,0,#REF!)","v":{"$error":"#REF!"}},{"$f":"IF(#REF!>$Y$3,0,#REF!)","v":{"$error":"#REF!"}},{"$f":"IF(#REF!>$Y$3,0,#REF!)","v":{"$error":"#REF!"}},{"$f":"IF(#REF!>$Y$3,0,#REF!)","v":{"$error":"#REF!"}},{"$f":"IF(#REF!>$Y$3,0,#REF!)","v":{"$error":"#REF!"}},{"$f":"IF(#REF!>$Y$3,0,#REF!)","v":{"$error":"#REF!"}},{"$f":"IF(#REF!>$Y$3,0,#REF!)","v":{"$error":"#REF!"}},{"$f":"IF(#REF!>$Y$3,0,#REF!)","v":{"$error":"#REF!"}},{"$f":"IF(#REF!>$Y$3,0,#REF!)","v":{"$error":"#REF!"}},{"$f":"IF(#REF!>$Y$3,0,#REF!)","v":{"$error":"#REF!"}},{"$f":"IF(#REF!>$Y$3,0,#REF!)","v":{"$error":"#REF!"}},{"$f":"IF(#REF!>$Y$3,0,#REF!)","v":{"$error":"#REF!"}},{"$f":"IF(#REF!>$Y$3,0,#REF!)","v":{"$error":"#REF!"}},{"$f":"IF(#REF!>$Y$3,0,#REF!)","v":{"$error":"#REF!"}},{"$f":"IF(#REF!>$Y$3,0,#REF!)","v":{"$error":"#REF!"}},{"$f":"IF(#REF!>$Y$3,0,#REF!)","v":{"$error":"#REF!"}},{"$f":"IF(#REF!>$Y$3,0,#REF!)","v":{"$error":"#REF!"}},{"$f":"IF(#REF!>$Y$3,0,#REF!)","v":{"$error":"#REF!"}}]
[null,null,18,{"$f":"IF('AS1'!D22=\"\",\"\",'AS1'!D22)","v":""},{"$f":"IF('AS1'!E22=\"\",\"\",'AS1'!E22)","v":""},null,null,null,null,null,null,null,null,null,null,null,null,null,null,null,null,null,null,null,null,null,null,null,null,null,null,null,null,null,null,null,null,null,null,null,null,null,null,null,null,null,null,null,null,null,null,null,null,null,null,null,null,0,{"$f":"IF(PARCIAL1!L$8=0,0,(ROUND(((BF22*10)/PARCIAL2!L$8),1)))","v":0},null,null,0,0,0,0,0,0,0,0,0,0,0,0,0,0,0,0,0,0,0,0,0,0,0,0,0,0,0,0,0,0,0,0,0,0,0,0,0,0,0,0,0,0,0,0,0,0,0,0,0,0,0,0,{"$f":"IF(#REF!>$Y$3,0,#REF!)","v":{"$error":"#REF!"}},{"$f":"IF(#REF!>$Y$3,0,#REF!)","v":{"$error":"#REF!"}},{"$f":"IF(#REF!>$Y$3,0,#REF!)","v":{"$error":"#REF!"}},{"$f":"IF(#REF!>$Y$3,0,#REF!)","v":{"$error":"#REF!"}},{"$f":"IF(#REF!>$Y$3,0,#REF!)","v":{"$error":"#REF!"}},{"$f":"IF(#REF!>$Y$3,0,#REF!)","v":{"$error":"#REF!"}},{"$f":"IF(#REF!>$Y$3,0,#REF!)","v":{"$error":"#REF!"}},{"$f":"IF(#REF!>$Y$3,0,#REF!)","v":{"$error":"#REF!"}},{"$f":"IF(#REF!>$Y$3,0,#REF!)","v":{"$error":"#REF!"}},{"$f":"IF(#REF!>$Y$3,0,#REF!)","v":{"$error":"#REF!"}},{"$f":"IF(#REF!>$Y$3,0,#REF!)","v":{"$error":"#REF!"}},{"$f":"IF(#REF!>$Y$3,0,#REF!)","v":{"$error":"#REF!"}},{"$f":"IF(#REF!>$Y$3,0,#REF!)","v":{"$error":"#REF!"}},{"$f":"IF(#REF!>$Y$3,0,#REF!)","v":{"$error":"#REF!"}},{"$f":"IF(#REF!>$Y$3,0,#REF!)","v":{"$error":"#REF!"}},{"$f":"IF(#REF!>$Y$3,0,#REF!)","v":{"$error":"#REF!"}},{"$f":"IF(#REF!>$Y$3,0,#REF!)","v":{"$error":"#REF!"}},{"$f":"IF(#REF!>$Y$3,0,#REF!)","v":{"$error":"#REF!"}},{"$f":"IF(#REF!>$Y$3,0,#REF!)","v":{"$error":"#REF!"}},{"$f":"IF(#REF!>$Y$3,0,#REF!)","v":{"$error":"#REF!"}},{"$f":"IF(#REF!>$Y$3,0,#REF!)","v":{"$error":"#REF!"}},{"$f":"IF(#REF!>$Y$3,0,#REF!)","v":{"$error":"#REF!"}},{"$f":"IF(#REF!>$Y$3,0,#REF!)","v":{"$error":"#REF!"}},{"$f":"IF(#REF!>$Y$3,0,#REF!)","v":{"$error":"#REF!"}},{"$f":"IF(#REF!>$Y$3,0,#REF!)","v":{"$error":"#REF!"}},{"$f":"IF(#REF!>$Y$3,0,#REF!)","v":{"$error":"#REF!"}},{"$f":"IF(#REF!>$Y$3,0,#REF!)","v":{"$error":"#REF!"}},{"$f":"IF(#REF!>$Y$3,0,#REF!)","v":{"$error":"#REF!"}}]
[null,null,19,{"$f":"IF('AS1'!D23=\"\",\"\",'AS1'!D23)","v":""},{"$f":"IF('AS1'!E23=\"\",\"\",'AS1'!E23)","v":""},null,null,null,null,null,null,null,null,null,null,null,null,null,null,null,null,null,null,null,null,null,null,null,null,null,null,null,null,null,null,null,null,null,null,null,null,null,null,null,null,null,null,null,null,null,null,null,null,null,null,null,null,0,{"$f":"IF(PARCIAL1!L$8=0,0,(ROUND(((BF23*10)/PARCIAL2!L$8),1)))","v":0},null,null,0,0,0,0,0,0,0,0,0,0,0,0,0,0,0,0,0,0,0,0,0,0,0,0,0,0,0,0,0,0,0,0,0,0,0,0,0,0,0,0,0,0,0,0,0,0,0,0,0,0,0,0,{"$f":"IF(#REF!>$Y$3,0,#REF!)","v":{"$error":"#REF!"}},{"$f":"IF(#REF!>$Y$3,0,#REF!)","v":{"$error":"#REF!"}},{"$f":"IF(#REF!>$Y$3,0,#REF!)","v":{"$error":"#REF!"}},{"$f":"IF(#REF!>$Y$3,0,#REF!)","v":{"$error":"#REF!"}},{"$f":"IF(#REF!>$Y$3,0,#REF!)","v":{"$error":"#REF!"}},{"$f":"IF(#REF!>$Y$3,0,#REF!)","v":{"$error":"#REF!"}},{"$f":"IF(#REF!>$Y$3,0,#REF!)","v":{"$error":"#REF!"}},{"$f":"IF(#REF!>$Y$3,0,#REF!)","v":{"$error":"#REF!"}},{"$f":"IF(#REF!>$Y$3,0,#REF!)","v":{"$error":"#REF!"}},{"$f":"IF(#REF!>$Y$3,0,#REF!)","v":{"$error":"#REF!"}},{"$f":"IF(#REF!>$Y$3,0,#REF!)","v":{"$error":"#REF!"}},{"$f":"IF(#REF!>$Y$3,0,#REF!)","v":{"$error":"#REF!"}},{"$f":"IF(#REF!>$Y$3,0,#REF!)","v":{"$error":"#REF!"}},{"$f":"IF(#REF!>$Y$3,0,#REF!)","v":{"$error":"#REF!"}},{"$f":"IF(#REF!>$Y$3,0,#REF!)","v":{"$error":"#REF!"}},{"$f":"IF(#REF!>$Y$3,0,#REF!)","v":{"$error":"#REF!"}},{"$f":"IF(#REF!>$Y$3,0,#REF!)","v":{"$error":"#REF!"}},{"$f":"IF(#REF!>$Y$3,0,#REF!)","v":{"$error":"#REF!"}},{"$f":"IF(#REF!>$Y$3,0,#REF!)","v":{"$error":"#REF!"}},{"$f":"IF(#REF!>$Y$3,0,#REF!)","v":{"$error":"#REF!"}},{"$f":"IF(#REF!>$Y$3,0,#REF!)","v":{"$error":"#REF!"}},{"$f":"IF(#REF!>$Y$3,0,#REF!)","v":{"$error":"#REF!"}},{"$f":"IF(#REF!>$Y$3,0,#REF!)","v":{"$error":"#REF!"}},{"$f":"IF(#REF!>$Y$3,0,#REF!)","v":{"$error":"#REF!"}},{"$f":"IF(#REF!>$Y$3,0,#REF!)","v":{"$error":"#REF!"}},{"$f":"IF(#REF!>$Y$3,0,#REF!)","v":{"$error":"#REF!"}},{"$f":"IF(#REF!>$Y$3,0,#REF!)","v":{"$error":"#REF!"}},{"$f":"IF(#REF!>$Y$3,0,#REF!)","v":{"$error":"#REF!"}}]
[null,null,20,{"$f":"IF('AS1'!D24=\"\",\"\",'AS1'!D24)","v":""},{"$f":"IF('AS1'!E24=\"\",\"\",'AS1'!E24)","v":""},null,null,null,null,null,null,null,null,null,null,null,null,null,null,null,null,null,null,null,null,null,null,null,null,null,null,null,null,null,null,null,null,null,null,null,null,null,null,null,null,null,null,null,null,null,null,null,null,null,null,null,null,0,{"$f":"IF(PARCIAL1!L$8=0,0,(ROUND(((BF24*10)/PARCIAL2!L$8),1)))","v":0},null,null,0,0,0,0,0,0,0,0,0,0,0,0,0,0,0,0,0,0,0,0,0,0,0,0,0,0,0,0,0,0,0,0,0,0,0,0,0,0,0,0,0,0,0,0,0,0,0,0,0,0,0,0,{"$f":"IF(#REF!>$Y$3,0,#REF!)","v":{"$error":"#REF!"}},{"$f":"IF(#REF!>$Y$3,0,#REF!)","v":{"$error":"#REF!"}},{"$f":"IF(#REF!>$Y$3,0,#REF!)","v":{"$error":"#REF!"}},{"$f":"IF(#REF!>$Y$3,0,#REF!)","v":{"$error":"#REF!"}},{"$f":"IF(#REF!>$Y$3,0,#REF!)","v":{"$error":"#REF!"}},{"$f":"IF(#REF!>$Y$3,0,#REF!)","v":{"$error":"#REF!"}},{"$f":"IF(#REF!>$Y$3,0,#REF!)","v":{"$error":"#REF!"}},{"$f":"IF(#REF!>$Y$3,0,#REF!)","v":{"$error":"#REF!"}},{"$f":"IF(#REF!>$Y$3,0,#REF!)","v":{"$error":"#REF!"}},{"$f":"IF(#REF!>$Y$3,0,#REF!)","v":{"$error":"#REF!"}},{"$f":"IF(#REF!>$Y$3,0,#REF!)","v":{"$error":"#REF!"}},{"$f":"IF(#REF!>$Y$3,0,#REF!)","v":{"$error":"#REF!"}},{"$f":"IF(#REF!>$Y$3,0,#REF!)","v":{"$error":"#REF!"}},{"$f":"IF(#REF!>$Y$3,0,#REF!)","v":{"$error":"#REF!"}},{"$f":"IF(#REF!>$Y$3,0,#REF!)","v":{"$error":"#REF!"}},{"$f":"IF(#REF!>$Y$3,0,#REF!)","v":{"$error":"#REF!"}},{"$f":"IF(#REF!>$Y$3,0,#REF!)","v":{"$error":"#REF!"}},{"$f":"IF(#REF!>$Y$3,0,#REF!)","v":{"$error":"#REF!"}},{"$f":"IF(#REF!>$Y$3,0,#REF!)","v":{"$error":"#REF!"}},{"$f":"IF(#REF!>$Y$3,0,#REF!)","v":{"$error":"#REF!"}},{"$f":"IF(#REF!>$Y$3,0,#REF!)","v":{"$error":"#REF!"}},{"$f":"IF(#REF!>$Y$3,0,#REF!)","v":{"$error":"#REF!"}},{"$f":"IF(#REF!>$Y$3,0,#REF!)","v":{"$error":"#REF!"}},{"$f":"IF(#REF!>$Y$3,0,#REF!)","v":{"$error":"#REF!"}},{"$f":"IF(#REF!>$Y$3,0,#REF!)","v":{"$error":"#REF!"}},{"$f":"IF(#REF!>$Y$3,0,#REF!)","v":{"$error":"#REF!"}},{"$f":"IF(#REF!>$Y$3,0,#REF!)","v":{"$error":"#REF!"}},{"$f":"IF(#REF!>$Y$3,0,#REF!)","v":{"$error":"#REF!"}}]
[null,null,21,{"$f":"IF('AS1'!D25=\"\",\"\",'AS1'!D25)","v":""},{"$f":"IF('AS1'!E25=\"\",\"\",'AS1'!E25)","v":""},null,null,null,null,null,null,null,null,null,null,null,null,null,null,null,null,null,null,null,null,null,null,null,null,null,null,null,null,null,null,null,null,null,null,null,null,null,null,null,null,null,null,null,null,null,null,null,null,null,null,null,null,0,{"$f":"IF(PARCIAL1!L$8=0,0,(ROUND(((BF25*10)/PARCIAL2!L$8),1)))","v":0},null,null,0,0,0,0,0,0,0,0,0,0,0,0,0,0,0,0,0,0,0,0,0,0,0,0,0,0,0,0,0,0,0,0,0,0,0,0,0,0,0,0,0,0,0,0,0,0,0,0,0,0,0,0,{"$f":"IF(#REF!>$Y$3,0,#REF!)","v":{"$error":"#REF!"}},{"$f":"IF(#REF!>$Y$3,0,#REF!)","v":{"$error":"#REF!"}},{"$f":"IF(#REF!>$Y$3,0,#REF!)","v":{"$error":"#REF!"}},{"$f":"IF(#REF!>$Y$3,0,#REF!)","v":{"$error":"#REF!"}},{"$f":"IF(#REF!>$Y$3,0,#REF!)","v":{"$error":"#REF!"}},{"$f":"IF(#REF!>$Y$3,0,#REF!)","v":{"$error":"#REF!"}},{"$f":"IF(#REF!>$Y$3,0,#REF!)","v":{"$error":"#REF!"}},{"$f":"IF(#REF!>$Y$3,0,#REF!)","v":{"$error":"#REF!"}},{"$f":"IF(#REF!>$Y$3,0,#REF!)","v":{"$error":"#REF!"}},{"$f":"IF(#REF!>$Y$3,0,#REF!)","v":{"$error":"#REF!"}},{"$f":"IF(#REF!>$Y$3,0,#REF!)","v":{"$error":"#REF!"}},{"$f":"IF(#REF!>$Y$3,0,#REF!)","v":{"$error":"#REF!"}},{"$f":"IF(#REF!>$Y$3,0,#REF!)","v":{"$error":"#REF!"}},{"$f":"IF(#REF!>$Y$3,0,#REF!)","v":{"$error":"#REF!"}},{"$f":"IF(#REF!>$Y$3,0,#REF!)","v":{"$error":"#REF!"}},{"$f":"IF(#REF!>$Y$3,0,#REF!)","v":{"$error":"#REF!"}},{"$f":"IF(#REF!>$Y$3,0,#REF!)","v":{"$error":"#REF!"}},{"$f":"IF(#REF!>$Y$3,0,#REF!)","v":{"$error":"#REF!"}},{"$f":"IF(#REF!>$Y$3,0,#REF!)","v":{"$error":"#REF!"}},{"$f":"IF(#REF!>$Y$3,0,#REF!)","v":{"$error":"#REF!"}},{"$f":"IF(#REF!>$Y$3,0,#REF!)","v":{"$error":"#REF!"}},{"$f":"IF(#REF!>$Y$3,0,#REF!)","v":{"$error":"#REF!"}},{"$f":"IF(#REF!>$Y$3,0,#REF!)","v":{"$error":"#REF!"}},{"$f":"IF(#REF!>$Y$3,0,#REF!)","v":{"$error":"#REF!"}},{"$f":"IF(#REF!>$Y$3,0,#REF!)","v":{"$error":"#REF!"}},{"$f":"IF(#REF!>$Y$3,0,#REF!)","v":{"$error":"#REF!"}},{"$f":"IF(#REF!>$Y$3,0,#REF!)","v":{"$error":"#REF!"}},{"$f":"IF(#REF!>$Y$3,0,#REF!)","v":{"$error":"#REF!"}}]
[null,null,22,{"$f":"IF('AS1'!D26=\"\",\"\",'AS1'!D26)","v":""},{"$f":"IF('AS1'!E26=\"\",\"\",'AS1'!E26)","v":""},null,null,null,null,null,null,null,null,null,null,null,null,null,null,null,null,null,null,null,null,null,null,null,null,null,null,null,null,null,null,null,null,null,null,null,null,null,null,null,null,null,null,null,null,null,null,null,null,null,null,null,null,0,{"$f":"IF(PARCIAL1!L$8=0,0,(ROUND(((BF26*10)/PARCIAL2!L$8),1)))","v":0},null,null,0,0,0,0,0,0,0,0,0,0,0,0,0,0,0,0,0,0,0,0,0,0,0,0,0,0,0,0,0,0,0,0,0,0,0,0,0,0,0,0,0,0,0,0,0,0,0,0,0,0,0,0,{"$f":"IF(#REF!>$Y$3,0,#REF!)","v":{"$error":"#REF!"}},{"$f":"IF(#REF!>$Y$3,0,#REF!)","v":{"$error":"#REF!"}},{"$f":"IF(#REF!>$Y$3,0,#REF!)","v":{"$error":"#REF!"}},{"$f":"IF(#REF!>$Y$3,0,#REF!)","v":{"$error":"#REF!"}},{"$f":"IF(#REF!>$Y$3,0,#REF!)","v":{"$error":"#REF!"}},{"$f":"IF(#REF!>$Y$3,0,#REF!)","v":{"$error":"#REF!"}},{"$f":"IF(#REF!>$Y$3,0,#REF!)","v":{"$error":"#REF!"}},{"$f":"IF(#REF!>$Y$3,0,#REF!)","v":{"$error":"#REF!"}},{"$f":"IF(#REF!>$Y$3,0,#REF!)","v":{"$error":"#REF!"}},{"$f":"IF(#REF!>$Y$3,0,#REF!)","v":{"$error":"#REF!"}},{"$f":"IF(#REF!>$Y$3,0,#REF!)","v":{"$error":"#REF!"}},{"$f":"IF(#REF!>$Y$3,0,#REF!)","v":{"$error":"#REF!"}},{"$f":"IF(#REF!>$Y$3,0,#REF!)","v":{"$error":"#REF!"}},{"$f":"IF(#REF!>$Y$3,0,#REF!)","v":{"$error":"#REF!"}},{"$f":"IF(#REF!>$Y$3,0,#REF!)","v":{"$error":"#REF!"}},{"$f":"IF(#REF!>$Y$3,0,#REF!)","v":{"$error":"#REF!"}},{"$f":"IF(#REF!>$Y$3,0,#REF!)","v":{"$error":"#REF!"}},{"$f":"IF(#REF!>$Y$3,0,#REF!)","v":{"$error":"#REF!"}},{"$f":"IF(#REF!>$Y$3,0,#REF!)","v":{"$error":"#REF!"}},{"$f":"IF(#REF!>$Y$3,0,#REF!)","v":{"$error":"#REF!"}},{"$f":"IF(#REF!>$Y$3,0,#REF!)","v":{"$error":"#REF!"}},{"$f":"IF(#REF!>$Y$3,0,#REF!)","v":{"$error":"#REF!"}},{"$f":"IF(#REF!>$Y$3,0,#REF!)","v":{"$error":"#REF!"}},{"$f":"IF(#REF!>$Y$3,0,#REF!)","v":{"$error":"#REF!"}},{"$f":"IF(#REF!>$Y$3,0,#REF!)","v":{"$error":"#REF!"}},{"$f":"IF(#REF!>$Y$3,0,#REF!)","v":{"$error":"#REF!"}},{"$f":"IF(#REF!>$Y$3,0,#REF!)","v":{"$error":"#REF!"}},{"$f":"IF(#REF!>$Y$3,0,#REF!)","v":{"$error":"#REF!"}}]
[null,null,23,{"$f":"IF('AS1'!D27=\"\",\"\",'AS1'!D27)","v":""},{"$f":"IF('AS1'!E27=\"\",\"\",'AS1'!E27)","v":""},null,null,null,null,null,null,null,null,null,null,null,null,null,null,null,null,null,null,null,null,null,null,null,null,null,null,null,null,null,null,null,null,null,null,null,null,null,null,null,null,null,null,null,null,null,null,null,null,null,null,null,null,0,{"$f":"IF(PARCIAL1!L$8=0,0,(ROUND(((BF27*10)/PARCIAL2!L$8),1)))","v":0},null,null,0,0,0,0,0,0,0,0,0,0,0,0,0,0,0,0,0,0,0,0,0,0,0,0,0,0,0,0,0,0,0,0,0,0,0,0,0,0,0,0,0,0,0,0,0,0,0,0,0,0,0,0,{"$f":"IF(#REF!>$Y$3,0,#REF!)","v":{"$error":"#REF!"}},{"$f":"IF(#REF!>$Y$3,0,#REF!)","v":{"$error":"#REF!"}},{"$f":"IF(#REF!>$Y$3,0,#REF!)","v":{"$error":"#REF!"}},{"$f":"IF(#REF!>$Y$3,0,#REF!)","v":{"$error":"#REF!"}},{"$f":"IF(#REF!>$Y$3,0,#REF!)","v":{"$error":"#REF!"}},{"$f":"IF(#REF!>$Y$3,0,#REF!)","v":{"$error":"#REF!"}},{"$f":"IF(#REF!>$Y$3,0,#REF!)","v":{"$error":"#REF!"}},{"$f":"IF(#REF!>$Y$3,0,#REF!)","v":{"$error":"#REF!"}},{"$f":"IF(#REF!>$Y$3,0,#REF!)","v":{"$error":"#REF!"}},{"$f":"IF(#REF!>$Y$3,0,#REF!)","v":{"$error":"#REF!"}},{"$f":"IF(#REF!>$Y$3,0,#REF!)","v":{"$error":"#REF!"}},{"$f":"IF(#REF!>$Y$3,0,#REF!)","v":{"$error":"#REF!"}},{"$f":"IF(#REF!>$Y$3,0,#REF!)","v":{"$error":"#REF!"}},{"$f":"IF(#REF!>$Y$3,0,#REF!)","v":{"$error":"#REF!"}},{"$f":"IF(#REF!>$Y$3,0,#REF!)","v":{"$error":"#REF!"}},{"$f":"IF(#REF!>$Y$3,0,#REF!)","v":{"$error":"#REF!"}},{"$f":"IF(#REF!>$Y$3,0,#REF!)","v":{"$error":"#REF!"}},{"$f":"IF(#REF!>$Y$3,0,#REF!)","v":{"$error":"#REF!"}},{"$f":"IF(#REF!>$Y$3,0,#REF!)","v":{"$error":"#REF!"}},{"$f":"IF(#REF!>$Y$3,0,#REF!)","v":{"$error":"#REF!"}},{"$f":"IF(#REF!>$Y$3,0,#REF!)","v":{"$error":"#REF!"}},{"$f":"IF(#REF!>$Y$3,0,#REF!)","v":{"$error":"#REF!"}},{"$f":"IF(#REF!>$Y$3,0,#REF!)","v":{"$error":"#REF!"}},{"$f":"IF(#REF!>$Y$3,0,#REF!)","v":{"$error":"#REF!"}},{"$f":"IF(#REF!>$Y$3,0,#REF!)","v":{"$error":"#REF!"}},{"$f":"IF(#REF!>$Y$3,0,#REF!)","v":{"$error":"#REF!"}},{"$f":"IF(#REF!>$Y$3,0,#REF!)","v":{"$error":"#REF!"}},{"$f":"IF(#REF!>$Y$3,0,#REF!)","v":{"$error":"#REF!"}}]
[null,null,24,{"$f":"IF('AS1'!D28=\"\",\"\",'AS1'!D28)","v":""},{"$f":"IF('AS1'!E28=\"\",\"\",'AS1'!E28)","v":""},null,null,null,null,null,null,null,null,null,null,null,null,null,null,null,null,null,null,null,null,null,null,null,null,null,null,null,null,null,null,null,null,null,null,null,null,null,null,null,null,null,null,null,null,null,null,null,null,null,null,null,null,0,{"$f":"IF(PARCIAL1!L$8=0,0,(ROUND(((BF28*10)/PARCIAL2!L$8),1)))","v":0},null,null,0,0,0,0,0,0,0,0,0,0,0,0,0,0,0,0,0,0,0,0,0,0,0,0,0,0,0,0,0,0,0,0,0,0,0,0,0,0,0,0,0,0,0,0,0,0,0,0,0,0,0,0,{"$f":"IF(#REF!>$Y$3,0,#REF!)","v":{"$error":"#REF!"}},{"$f":"IF(#REF!>$Y$3,0,#REF!)","v":{"$error":"#REF!"}},{"$f":"IF(#REF!>$Y$3,0,#REF!)","v":{"$error":"#REF!"}},{"$f":"IF(#REF!>$Y$3,0,#REF!)","v":{"$error":"#REF!"}},{"$f":"IF(#REF!>$Y$3,0,#REF!)","v":{"$error":"#REF!"}},{"$f":"IF(#REF!>$Y$3,0,#REF!)","v":{"$error":"#REF!"}},{"$f":"IF(#REF!>$Y$3,0,#REF!)","v":{"$error":"#REF!"}},{"$f":"IF(#REF!>$Y$3,0,#REF!)","v":{"$error":"#REF!"}},{"$f":"IF(#REF!>$Y$3,0,#REF!)","v":{"$error":"#REF!"}},{"$f":"IF(#REF!>$Y$3,0,#REF!)","v":{"$error":"#REF!"}},{"$f":"IF(#REF!>$Y$3,0,#REF!)","v":{"$error":"#REF!"}},{"$f":"IF(#REF!>$Y$3,0,#REF!)","v":{"$error":"#REF!"}},{"$f":"IF(#REF!>$Y$3,0,#REF!)","v":{"$error":"#REF!"}},{"$f":"IF(#REF!>$Y$3,0,#REF!)","v":{"$error":"#REF!"}},{"$f":"IF(#REF!>$Y$3,0,#REF!)","v":{"$error":"#REF!"}},{"$f":"IF(#REF!>$Y$3,0,#REF!)","v":{"$error":"#REF!"}},{"$f":"IF(#REF!>$Y$3,0,#REF!)","v":{"$error":"#REF!"}},{"$f":"IF(#REF!>$Y$3,0,#REF!)","v":{"$error":"#REF!"}},{"$f":"IF(#REF!>$Y$3,0,#REF!)","v":{"$error":"#REF!"}},{"$f":"IF(#REF!>$Y$3,0,#REF!)","v":{"$error":"#REF!"}},{"$f":"IF(#REF!>$Y$3,0,#REF!)","v":{"$error":"#REF!"}},{"$f":"IF(#REF!>$Y$3,0,#REF!)","v":{"$error":"#REF!"}},{"$f":"IF(#REF!>$Y$3,0,#REF!)","v":{"$error":"#REF!"}},{"$f":"IF(#REF!>$Y$3,0,#REF!)","v":{"$error":"#REF!"}},{"$f":"IF(#REF!>$Y$3,0,#REF!)","v":{"$error":"#REF!"}},{"$f":"IF(#REF!>$Y$3,0,#REF!)","v":{"$error":"#REF!"}},{"$f":"IF(#REF!>$Y$3,0,#REF!)","v":{"$error":"#REF!"}},{"$f":"IF(#REF!>$Y$3,0,#REF!)","v":{"$error":"#REF!"}}]
[null,null,25,{"$f":"IF('AS1'!D29=\"\",\"\",'AS1'!D29)","v":""},{"$f":"IF('AS1'!E29=\"\",\"\",'AS1'!E29)","v":""},null,null,null,null,null,null,null,null,null,null,null,null,null,null,null,null,null,null,null,null,null,null,null,null,null,null,null,null,null,null,null,null,null,null,null,null,null,null,null,null,null,null,null,null,null,null,null,null,null,null,null,null,0,{"$f":"IF(PARCIAL1!L$8=0,0,(ROUND(((BF29*10)/PARCIAL2!L$8),1)))","v":0},null,null,0,0,0,0,0,0,0,0,0,0,0,0,0,0,0,0,0,0,0,0,0,0,0,0,0,0,0,0,0,0,0,0,0,0,0,0,0,0,0,0,0,0,0,0,0,0,0,0,0,0,0,0,{"$f":"IF(#REF!>$Y$3,0,#REF!)","v":{"$error":"#REF!"}},{"$f":"IF(#REF!>$Y$3,0,#REF!)","v":{"$error":"#REF!"}},{"$f":"IF(#REF!>$Y$3,0,#REF!)","v":{"$error":"#REF!"}},{"$f":"IF(#REF!>$Y$3,0,#REF!)","v":{"$error":"#REF!"}},{"$f":"IF(#REF!>$Y$3,0,#REF!)","v":{"$error":"#REF!"}},{"$f":"IF(#REF!>$Y$3,0,#REF!)","v":{"$error":"#REF!"}},{"$f":"IF(#REF!>$Y$3,0,#REF!)","v":{"$error":"#REF!"}},{"$f":"IF(#REF!>$Y$3,0,#REF!)","v":{"$error":"#REF!"}},{"$f":"IF(#REF!>$Y$3,0,#REF!)","v":{"$error":"#REF!"}},{"$f":"IF(#REF!>$Y$3,0,#REF!)","v":{"$error":"#REF!"}},{"$f":"IF(#REF!>$Y$3,0,#REF!)","v":{"$error":"#REF!"}},{"$f":"IF(#REF!>$Y$3,0,#REF!)","v":{"$error":"#REF!"}},{"$f":"IF(#REF!>$Y$3,0,#REF!)","v":{"$error":"#REF!"}},{"$f":"IF(#REF!>$Y$3,0,#REF!)","v":{"$error":"#REF!"}},{"$f":"IF(#REF!>$Y$3,0,#REF!)","v":{"$error":"#REF!"}},{"$f":"IF(#REF!>$Y$3,0,#REF!)","v":{"$error":"#REF!"}},{"$f":"IF(#REF!>$Y$3,0,#REF!)","v":{"$error":"#REF!"}},{"$f":"IF(#REF!>$Y$3,0,#REF!)","v":{"$error":"#REF!"}},{"$f":"IF(#REF!>$Y$3,0,#REF!)","v":{"$error":"#REF!"}},{"$f":"IF(#REF!>$Y$3,0,#REF!)","v":{"$error":"#REF!"}},{"$f":"IF(#REF!>$Y$3,0,#REF!)","v":{"$error":"#REF!"}},{"$f":"IF(#REF!>$Y$3,0,#REF!)","v":{"$error":"#REF!"}},{"$f":"IF(#REF!>$Y$3,0,#REF!)","v":{"$error":"#REF!"}},{"$f":"IF(#REF!>$Y$3,0,#REF!)","v":{"$error":"#REF!"}},{"$f":"IF(#REF!>$Y$3,0,#REF!)","v":{"$error":"#REF!"}},{"$f":"IF(#REF!>$Y$3,0,#REF!)","v":{"$error":"#REF!"}},{"$f":"IF(#REF!>$Y$3,0,#REF!)","v":{"$error":"#REF!"}},{"$f":"IF(#REF!>$Y$3,0,#REF!)","v":{"$error":"#REF!"}}]
[null,null,26,{"$f":"IF('AS1'!D30=\"\",\"\",'AS1'!D30)","v":""},{"$f":"IF('AS1'!E30=\"\",\"\",'AS1'!E30)","v":""},null,null,null,null,null,null,null,null,null,null,null,null,null,null,null,null,null,null,null,null,null,null,null,null,null,null,null,null,null,null,null,null,null,null,null,null,null,null,null,null,null,null,null,null,null,null,null,null,null,null,null,null,0,{"$f":"IF(PARCIAL1!L$8=0,0,(ROUND(((BF30*10)/PARCIAL2!L$8),1)))","v":0},null,null,0,0,0,0,0,0,0,0,0,0,0,0,0,0,0,0,0,0,0,0,0,0,0,0,0,0,0,0,0,0,0,0,0,0,0,0,0,0,0,0,0,0,0,0,0,0,0,0,0,0,0,0,{"$f":"IF(#REF!>$Y$3,0,#REF!)","v":{"$error":"#REF!"}},{"$f":"IF(#REF!>$Y$3,0,#REF!)","v":{"$error":"#REF!"}},{"$f":"IF(#REF!>$Y$3,0,#REF!)","v":{"$error":"#REF!"}},{"$f":"IF(#REF!>$Y$3,0,#REF!)","v":{"$error":"#REF!"}},{"$f":"IF(#REF!>$Y$3,0,#REF!)","v":{"$error":"#REF!"}},{"$f":"IF(#REF!>$Y$3,0,#REF!)","v":{"$error":"#REF!"}},{"$f":"IF(#REF!>$Y$3,0,#REF!)","v":{"$error":"#REF!"}},{"$f":"IF(#REF!>$Y$3,0,#REF!)","v":{"$error":"#REF!"}},{"$f":"IF(#REF!>$Y$3,0,#REF!)","v":{"$error":"#REF!"}},{"$f":"IF(#REF!>$Y$3,0,#REF!)","v":{"$error":"#REF!"}},{"$f":"IF(#REF!>$Y$3,0,#REF!)","v":{"$error":"#REF!"}},{"$f":"IF(#REF!>$Y$3,0,#REF!)","v":{"$error":"#REF!"}},{"$f":"IF(#REF!>$Y$3,0,#REF!)","v":{"$error":"#REF!"}},{"$f":"IF(#REF!>$Y$3,0,#REF!)","v":{"$error":"#REF!"}},{"$f":"IF(#REF!>$Y$3,0,#REF!)","v":{"$error":"#REF!"}},{"$f":"IF(#REF!>$Y$3,0,#REF!)","v":{"$error":"#REF!"}},{"$f":"IF(#REF!>$Y$3,0,#REF!)","v":{"$error":"#REF!"}},{"$f":"IF(#REF!>$Y$3,0,#REF!)","v":{"$error":"#REF!"}},{"$f":"IF(#REF!>$Y$3,0,#REF!)","v":{"$error":"#REF!"}},{"$f":"IF(#REF!>$Y$3,0,#REF!)","v":{"$error":"#REF!"}},{"$f":"IF(#REF!>$Y$3,0,#REF!)","v":{"$error":"#REF!"}},{"$f":"IF(#REF!>$Y$3,0,#REF!)","v":{"$error":"#REF!"}},{"$f":"IF(#REF!>$Y$3,0,#REF!)","v":{"$error":"#REF!"}},{"$f":"IF(#REF!>$Y$3,0,#REF!)","v":{"$error":"#REF!"}},{"$f":"IF(#REF!>$Y$3,0,#REF!)","v":{"$error":"#REF!"}},{"$f":"IF(#REF!>$Y$3,0,#REF!)","v":{"$error":"#REF!"}},{"$f":"IF(#REF!>$Y$3,0,#REF!)","v":{"$error":"#REF!"}},{"$f":"IF(#REF!>$Y$3,0,#REF!)","v":{"$error":"#REF!"}}]
[null,null,27,{"$f":"IF('AS1'!D31=\"\",\"\",'AS1'!D31)","v":""},{"$f":"IF('AS1'!E31=\"\",\"\",'AS1'!E31)","v":""},null,null,null,null,null,null,null,null,null,null,null,null,null,null,null,null,null,null,null,null,null,null,null,null,null,null,null,null,null,null,null,null,null,null,null,null,null,null,null,null,null,null,null,null,null,null,null,null,null,null,null,null,0,{"$f":"IF(PARCIAL1!L$8=0,0,(ROUND(((BF31*10)/PARCIAL2!L$8),1)))","v":0},null,null,0,0,0,0,0,0,0,0,0,0,0,0,0,0,0,0,0,0,0,0,0,0,0,0,0,0,0,0,0,0,0,0,0,0,0,0,0,0,0,0,0,0,0,0,0,0,0,0,0,0,0,0,{"$f":"IF(#REF!>$Y$3,0,#REF!)","v":{"$error":"#REF!"}},{"$f":"IF(#REF!>$Y$3,0,#REF!)","v":{"$error":"#REF!"}},{"$f":"IF(#REF!>$Y$3,0,#REF!)","v":{"$error":"#REF!"}},{"$f":"IF(#REF!>$Y$3,0,#REF!)","v":{"$error":"#REF!"}},{"$f":"IF(#REF!>$Y$3,0,#REF!)","v":{"$error":"#REF!"}},{"$f":"IF(#REF!>$Y$3,0,#REF!)","v":{"$error":"#REF!"}},{"$f":"IF(#REF!>$Y$3,0,#REF!)","v":{"$error":"#REF!"}},{"$f":"IF(#REF!>$Y$3,0,#REF!)","v":{"$error":"#REF!"}},{"$f":"IF(#REF!>$Y$3,0,#REF!)","v":{"$error":"#REF!"}},{"$f":"IF(#REF!>$Y$3,0,#REF!)","v":{"$error":"#REF!"}},{"$f":"IF(#REF!>$Y$3,0,#REF!)","v":{"$error":"#REF!"}},{"$f":"IF(#REF!>$Y$3,0,#REF!)","v":{"$error":"#REF!"}},{"$f":"IF(#REF!>$Y$3,0,#REF!)","v":{"$error":"#REF!"}},{"$f":"IF(#REF!>$Y$3,0,#REF!)","v":{"$error":"#REF!"}},{"$f":"IF(#REF!>$Y$3,0,#REF!)","v":{"$error":"#REF!"}},{"$f":"IF(#REF!>$Y$3,0,#REF!)","v":{"$error":"#REF!"}},{"$f":"IF(#REF!>$Y$3,0,#REF!)","v":{"$error":"#REF!"}},{"$f":"IF(#REF!>$Y$3,0,#REF!)","v":{"$error":"#REF!"}},{"$f":"IF(#REF!>$Y$3,0,#REF!)","v":{"$error":"#REF!"}},{"$f":"IF(#REF!>$Y$3,0,#REF!)","v":{"$error":"#REF!"}},{"$f":"IF(#REF!>$Y$3,0,#REF!)","v":{"$error":"#REF!"}},{"$f":"IF(#REF!>$Y$3,0,#REF!)","v":{"$error":"#REF!"}},{"$f":"IF(#REF!>$Y$3,0,#REF!)","v":{"$error":"#REF!"}},{"$f":"IF(#REF!>$Y$3,0,#REF!)","v":{"$error":"#REF!"}},{"$f":"IF(#REF!>$Y$3,0,#REF!)","v":{"$error":"#REF!"}},{"$f":"IF(#REF!>$Y$3,0,#REF!)","v":{"$error":"#REF!"}},{"$f":"IF(#REF!>$Y$3,0,#REF!)","v":{"$error":"#REF!"}},{"$f":"IF(#REF!>$Y$3,0,#REF!)","v":{"$error":"#REF!"}}]
[null,null,28,{"$f":"IF('AS1'!D32=\"\",\"\",'AS1'!D32)","v":""},{"$f":"IF('AS1'!E32=\"\",\"\",'AS1'!E32)","v":""},null,null,null,null,null,null,null,null,null,null,null,null,null,null,null,null,null,null,null,null,null,null,null,null,null,null,null,null,null,null,null,null,null,null,null,null,null,null,null,null,null,null,null,null,null,null,null,null,null,null,null,null,0,{"$f":"IF(PARCIAL1!L$8=0,0,(ROUND(((BF32*10)/PARCIAL2!L$8),1)))","v":0},null,null,0,0,0,0,0,0,0,0,0,0,0,0,0,0,0,0,0,0,0,0,0,0,0,0,0,0,0,0,0,0,0,0,0,0,0,0,0,0,0,0,0,0,0,0,0,0,0,0,0,0,0,0,{"$f":"IF(#REF!>$Y$3,0,#REF!)","v":{"$error":"#REF!"}},{"$f":"IF(#REF!>$Y$3,0,#REF!)","v":{"$error":"#REF!"}},{"$f":"IF(#REF!>$Y$3,0,#REF!)","v":{"$error":"#REF!"}},{"$f":"IF(#REF!>$Y$3,0,#REF!)","v":{"$error":"#REF!"}},{"$f":"IF(#REF!>$Y$3,0,#REF!)","v":{"$error":"#REF!"}},{"$f":"IF(#REF!>$Y$3,0,#REF!)","v":{"$error":"#REF!"}},{"$f":"IF(#REF!>$Y$3,0,#REF!)","v":{"$error":"#REF!"}},{"$f":"IF(#REF!>$Y$3,0,#REF!)","v":{"$error":"#REF!"}},{"$f":"IF(#REF!>$Y$3,0,#REF!)","v":{"$error":"#REF!"}},{"$f":"IF(#REF!>$Y$3,0,#REF!)","v":{"$error":"#REF!"}},{"$f":"IF(#REF!>$Y$3,0,#REF!)","v":{"$error":"#REF!"}},{"$f":"IF(#REF!>$Y$3,0,#REF!)","v":{"$error":"#REF!"}},{"$f":"IF(#REF!>$Y$3,0,#REF!)","v":{"$error":"#REF!"}},{"$f":"IF(#REF!>$Y$3,0,#REF!)","v":{"$error":"#REF!"}},{"$f":"IF(#REF!>$Y$3,0,#REF!)","v":{"$error":"#REF!"}},{"$f":"IF(#REF!>$Y$3,0,#REF!)","v":{"$error":"#REF!"}},{"$f":"IF(#REF!>$Y$3,0,#REF!)","v":{"$error":"#REF!"}},{"$f":"IF(#REF!>$Y$3,0,#REF!)","v":{"$error":"#REF!"}},{"$f":"IF(#REF!>$Y$3,0,#REF!)","v":{"$error":"#REF!"}},{"$f":"IF(#REF!>$Y$3,0,#REF!)","v":{"$error":"#REF!"}},{"$f":"IF(#REF!>$Y$3,0,#REF!)","v":{"$error":"#REF!"}},{"$f":"IF(#REF!>$Y$3,0,#REF!)","v":{"$error":"#REF!"}},{"$f":"IF(#REF!>$Y$3,0,#REF!)","v":{"$error":"#REF!"}},{"$f":"IF(#REF!>$Y$3,0,#REF!)","v":{"$error":"#REF!"}},{"$f":"IF(#REF!>$Y$3,0,#REF!)","v":{"$error":"#REF!"}},{"$f":"IF(#REF!>$Y$3,0,#REF!)","v":{"$error":"#REF!"}},{"$f":"IF(#REF!>$Y$3,0,#REF!)","v":{"$error":"#REF!"}},{"$f":"IF(#REF!>$Y$3,0,#REF!)","v":{"$error":"#REF!"}}]
[null,null,29,{"$f":"IF('AS1'!D33=\"\",\"\",'AS1'!D33)","v":""},{"$f":"IF('AS1'!E33=\"\",\"\",'AS1'!E33)","v":""},null,null,null,null,null,null,null,null,null,null,null,null,null,null,null,null,null,null,null,null,null,null,null,null,null,null,null,null,null,null,null,null,null,null,null,null,null,null,null,null,null,null,null,null,null,null,null,null,null,null,null,null,0,{"$f":"IF(PARCIAL1!L$8=0,0,(ROUND(((BF33*10)/PARCIAL2!L$8),1)))","v":0},null,null,0,0,0,0,0,0,0,0,0,0,0,0,0,0,0,0,0,0,0,0,0,0,0,0,0,0,0,0,0,0,0,0,0,0,0,0,0,0,0,0,0,0,0,0,0,0,0,0,0,0,0,0,{"$f":"IF(#REF!>$Y$3,0,#REF!)","v":{"$error":"#REF!"}},{"$f":"IF(#REF!>$Y$3,0,#REF!)","v":{"$error":"#REF!"}},{"$f":"IF(#REF!>$Y$3,0,#REF!)","v":{"$error":"#REF!"}},{"$f":"IF(#REF!>$Y$3,0,#REF!)","v":{"$error":"#REF!"}},{"$f":"IF(#REF!>$Y$3,0,#REF!)","v":{"$error":"#REF!"}},{"$f":"IF(#REF!>$Y$3,0,#REF!)","v":{"$error":"#REF!"}},{"$f":"IF(#REF!>$Y$3,0,#REF!)","v":{"$error":"#REF!"}},{"$f":"IF(#REF!>$Y$3,0,#REF!)","v":{"$error":"#REF!"}},{"$f":"IF(#REF!>$Y$3,0,#REF!)","v":{"$error":"#REF!"}},{"$f":"IF(#REF!>$Y$3,0,#REF!)","v":{"$error":"#REF!"}},{"$f":"IF(#REF!>$Y$3,0,#REF!)","v":{"$error":"#REF!"}},{"$f":"IF(#REF!>$Y$3,0,#REF!)","v":{"$error":"#REF!"}},{"$f":"IF(#REF!>$Y$3,0,#REF!)","v":{"$error":"#REF!"}},{"$f":"IF(#REF!>$Y$3,0,#REF!)","v":{"$error":"#REF!"}},{"$f":"IF(#REF!>$Y$3,0,#REF!)","v":{"$error":"#REF!"}},{"$f":"IF(#REF!>$Y$3,0,#REF!)","v":{"$error":"#REF!"}},{"$f":"IF(#REF!>$Y$3,0,#REF!)","v":{"$error":"#REF!"}},{"$f":"IF(#REF!>$Y$3,0,#REF!)","v":{"$error":"#REF!"}},{"$f":"IF(#REF!>$Y$3,0,#REF!)","v":{"$error":"#REF!"}},{"$f":"IF(#REF!>$Y$3,0,#REF!)","v":{"$error":"#REF!"}},{"$f":"IF(#REF!>$Y$3,0,#REF!)","v":{"$error":"#REF!"}},{"$f":"IF(#REF!>$Y$3,0,#REF!)","v":{"$error":"#REF!"}},{"$f":"IF(#REF!>$Y$3,0,#REF!)","v":{"$error":"#REF!"}},{"$f":"IF(#REF!>$Y$3,0,#REF!)","v":{"$error":"#REF!"}},{"$f":"IF(#REF!>$Y$3,0,#REF!)","v":{"$error":"#REF!"}},{"$f":"IF(#REF!>$Y$3,0,#REF!)","v":{"$error":"#REF!"}},{"$f":"IF(#REF!>$Y$3,0,#REF!)","v":{"$error":"#REF!"}},{"$f":"IF(#REF!>$Y$3,0,#REF!)","v":{"$error":"#REF!"}}]
[null,null,30,{"$f":"IF('AS1'!D34=\"\",\"\",'AS1'!D34)","v":""},{"$f":"IF('AS1'!E34=\"\",\"\",'AS1'!E34)","v":""},null,null,null,null,null,null,null,null,null,null,null,null,null,null,null,null,null,null,null,null,null,null,null,null,null,null,null,null,null,null,null,null,null,null,null,null,null,null,null,null,null,null,null,null,null,null,null,null,null,null,null,null,0,{"$f":"IF(PARCIAL1!L$8=0,0,(ROUND(((BF34*10)/PARCIAL2!L$8),1)))","v":0},null,null,0,0,0,0,0,0,0,0,0,0,0,0,0,0,0,0,0,0,0,0,0,0,0,0,0,0,0,0,0,0,0,0,0,0,0,0,0,0,0,0,0,0,0,0,0,0,0,0,0,0,0,0,{"$f":"IF(#REF!>$Y$3,0,#REF!)","v":{"$error":"#REF!"}},{"$f":"IF(#REF!>$Y$3,0,#REF!)","v":{"$error":"#REF!"}},{"$f":"IF(#REF!>$Y$3,0,#REF!)","v":{"$error":"#REF!"}},{"$f":"IF(#REF!>$Y$3,0,#REF!)","v":{"$error":"#REF!"}},{"$f":"IF(#REF!>$Y$3,0,#REF!)","v":{"$error":"#REF!"}},{"$f":"IF(#REF!>$Y$3,0,#REF!)","v":{"$error":"#REF!"}},{"$f":"IF(#REF!>$Y$3,0,#REF!)","v":{"$error":"#REF!"}},{"$f":"IF(#REF!>$Y$3,0,#REF!)","v":{"$error":"#REF!"}},{"$f":"IF(#REF!>$Y$3,0,#REF!)","v":{"$error":"#REF!"}},{"$f":"IF(#REF!>$Y$3,0,#REF!)","v":{"$error":"#REF!"}},{"$f":"IF(#REF!>$Y$3,0,#REF!)","v":{"$error":"#REF!"}},{"$f":"IF(#REF!>$Y$3,0,#REF!)","v":{"$error":"#REF!"}},{"$f":"IF(#REF!>$Y$3,0,#REF!)","v":{"$error":"#REF!"}},{"$f":"IF(#REF!>$Y$3,0,#REF!)","v":{"$error":"#REF!"}},{"$f":"IF(#REF!>$Y$3,0,#REF!)","v":{"$error":"#REF!"}},{"$f":"IF(#REF!>$Y$3,0,#REF!)","v":{"$error":"#REF!"}},{"$f":"IF(#REF!>$Y$3,0,#REF!)","v":{"$error":"#REF!"}},{"$f":"IF(#REF!>$Y$3,0,#REF!)","v":{"$error":"#REF!"}},{"$f":"IF(#REF!>$Y$3,0,#REF!)","v":{"$error":"#REF!"}},{"$f":"IF(#REF!>$Y$3,0,#REF!)","v":{"$error":"#REF!"}},{"$f":"IF(#REF!>$Y$3,0,#REF!)","v":{"$error":"#REF!"}},{"$f":"IF(#REF!>$Y$3,0,#REF!)","v":{"$error":"#REF!"}},{"$f":"IF(#REF!>$Y$3,0,#REF!)","v":{"$error":"#REF!"}},{"$f":"IF(#REF!>$Y$3,0,#REF!)","v":{"$error":"#REF!"}},{"$f":"IF(#REF!>$Y$3,0,#REF!)","v":{"$error":"#REF!"}},{"$f":"IF(#REF!>$Y$3,0,#REF!)","v":{"$error":"#REF!"}},{"$f":"IF(#REF!>$Y$3,0,#REF!)","v":{"$error":"#REF!"}},{"$f":"IF(#REF!>$Y$3,0,#REF!)","v":{"$error":"#REF!"}}]
[null,null,31,{"$f":"IF('AS1'!D35=\"\",\"\",'AS1'!D35)","v":""},{"$f":"IF('AS1'!E35=\"\",\"\",'AS1'!E35)","v":""},null,null,null,null,null,null,null,null,null,null,null,null,null,null,null,null,null,null,null,null,null,null,null,null,null,null,null,null,null,null,null,null,null,null,null,null,null,null,null,null,null,null,null,null,null,null,null,null,null,null,null,null,0,{"$f":"IF(PARCIAL1!L$8=0,0,(ROUND(((BF35*10)/PARCIAL2!L$8),1)))","v":0},null,null,0,0,0,0,0,0,0,0,0,0,0,0,0,0,0,0,0,0,0,0,0,0,0,0,0,0,0,0,0,0,0,0,0,0,0,0,0,0,0,0,0,0,0,0,0,0,0,0,0,0,0,0,{"$f":"IF(#REF!>$Y$3,0,#REF!)","v":{"$error":"#REF!"}},{"$f":"IF(#REF!>$Y$3,0,#REF!)","v":{"$error":"#REF!"}},{"$f":"IF(#REF!>$Y$3,0,#REF!)","v":{"$error":"#REF!"}},{"$f":"IF(#REF!>$Y$3,0,#REF!)","v":{"$error":"#REF!"}},{"$f":"IF(#REF!>$Y$3,0,#REF!)","v":{"$error":"#REF!"}},{"$f":"IF(#REF!>$Y$3,0,#REF!)","v":{"$error":"#REF!"}},{"$f":"IF(#REF!>$Y$3,0,#REF!)","v":{"$error":"#REF!"}},{"$f":"IF(#REF!>$Y$3,0,#REF!)","v":{"$error":"#REF!"}},{"$f":"IF(#REF!>$Y$3,0,#REF!)","v":{"$error":"#REF!"}},{"$f":"IF(#REF!>$Y$3,0,#REF!)","v":{"$error":"#REF!"}},{"$f":"IF(#REF!>$Y$3,0,#REF!)","v":{"$error":"#REF!"}},{"$f":"IF(#REF!>$Y$3,0,#REF!)","v":{"$error":"#REF!"}},{"$f":"IF(#REF!>$Y$3,0,#REF!)","v":{"$error":"#REF!"}},{"$f":"IF(#REF!>$Y$3,0,#REF!)","v":{"$error":"#REF!"}},{"$f":"IF(#REF!>$Y$3,0,#REF!)","v":{"$error":"#REF!"}},{"$f":"IF(#REF!>$Y$3,0,#REF!)","v":{"$error":"#REF!"}},{"$f":"IF(#REF!>$Y$3,0,#REF!)","v":{"$error":"#REF!"}},{"$f":"IF(#REF!>$Y$3,0,#REF!)","v":{"$error":"#REF!"}},{"$f":"IF(#REF!>$Y$3,0,#REF!)","v":{"$error":"#REF!"}},{"$f":"IF(#REF!>$Y$3,0,#REF!)","v":{"$error":"#REF!"}},{"$f":"IF(#REF!>$Y$3,0,#REF!)","v":{"$error":"#REF!"}},{"$f":"IF(#REF!>$Y$3,0,#REF!)","v":{"$error":"#REF!"}},{"$f":"IF(#REF!>$Y$3,0,#REF!)","v":{"$error":"#REF!"}},{"$f":"IF(#REF!>$Y$3,0,#REF!)","v":{"$error":"#REF!"}},{"$f":"IF(#REF!>$Y$3,0,#REF!)","v":{"$error":"#REF!"}},{"$f":"IF(#REF!>$Y$3,0,#REF!)","v":{"$error":"#REF!"}},{"$f":"IF(#REF!>$Y$3,0,#REF!)","v":{"$error":"#REF!"}},{"$f":"IF(#REF!>$Y$3,0,#REF!)","v":{"$error":"#REF!"}}]
[null,null,32,{"$f":"IF('AS1'!D36=\"\",\"\",'AS1'!D36)","v":""},{"$f":"IF('AS1'!E36=\"\",\"\",'AS1'!E36)","v":""},null,null,null,null,null,null,null,null,null,null,null,null,null,null,null,null,null,null,null,null,null,null,null,null,null,null,null,null,null,null,null,null,null,null,null,null,null,null,null,null,null,null,null,null,null,null,null,null,null,null,null,null,0,{"$f":"IF(PARCIAL1!L$8=0,0,(ROUND(((BF36*10)/PARCIAL2!L$8),1)))","v":0},null,null,0,0,0,0,0,0,0,0,0,0,0,0,0,0,0,{"$f":"IF(U36>$Y$3,0,U36)","v":0},0,0,0,0,0,0,0,0,0,0,0,0,0,0,0,0,0,0,0,0,0,0,0,0,0,0,0,0,{"$f":"IF(AX36>$Y$3,0,AX36)","v":0},0,0,0,0,0,0,0,{"$f":"IF(#REF!>$Y$3,0,#REF!)","v":{"$error":"#REF!"}},{"$f":"IF(#REF!>$Y$3,0,#REF!)","v":{"$error":"#REF!"}},{"$f":"IF(#REF!>$Y$3,0,#REF!)","v":{"$error":"#REF!"}},{"$f":"IF(#REF!>$Y$3,0,#REF!)","v":{"$error":"#REF!"}},{"$f":"IF(#REF!>$Y$3,0,#REF!)","v":{"$error":"#REF!"}},{"$f":"IF(#REF!>$Y$3,0,#REF!)","v":{"$error":"#REF!"}},{"$f":"IF(#REF!>$Y$3,0,#REF!)","v":{"$error":"#REF!"}},{"$f":"IF(#REF!>$Y$3,0,#REF!)","v":{"$error":"#REF!"}},{"$f":"IF(#REF!>$Y$3,0,#REF!)","v":{"$error":"#REF!"}},{"$f":"IF(#REF!>$Y$3,0,#REF!)","v":{"$error":"#REF!"}},{"$f":"IF(#REF!>$Y$3,0,#REF!)","v":{"$error":"#REF!"}},{"$f":"IF(#REF!>$Y$3,0,#REF!)","v":{"$error":"#REF!"}},{"$f":"IF(#REF!>$Y$3,0,#REF!)","v":{"$error":"#REF!"}},{"$f":"IF(#REF!>$Y$3,0,#REF!)","v":{"$error":"#REF!"}},{"$f":"IF(#REF!>$Y$3,0,#REF!)","v":{"$error":"#REF!"}},{"$f":"IF(#REF!>$Y$3,0,#REF!)","v":{"$error":"#REF!"}},{"$f":"IF(#REF!>$Y$3,0,#REF!)","v":{"$error":"#REF!"}},{"$f":"IF(#REF!>$Y$3,0,#REF!)","v":{"$error":"#REF!"}},{"$f":"IF(#REF!>$Y$3,0,#REF!)","v":{"$error":"#REF!"}},{"$f":"IF(#REF!>$Y$3,0,#REF!)","v":{"$error":"#REF!"}},{"$f":"IF(#REF!>$Y$3,0,#REF!)","v":{"$error":"#REF!"}},{"$f":"IF(#REF!>$Y$3,0,#REF!)","v":{"$error":"#REF!"}},{"$f":"IF(#REF!>$Y$3,0,#REF!)","v":{"$error":"#REF!"}},{"$f":"IF(#REF!>$Y$3,0,#REF!)","v":{"$error":"#REF!"}},{"$f":"IF(#REF!>$Y$3,0,#REF!)","v":{"$error":"#REF!"}},{"$f":"IF(#REF!>$Y$3,0,#REF!)","v":{"$error":"#REF!"}},{"$f":"IF(#REF!>$Y$3,0,#REF!)","v":{"$error":"#REF!"}},{"$f":"IF(#REF!>$Y$3,0,#REF!)","v":{"$error":"#REF!"}}]
[null,null,33,{"$f":"IF('AS1'!D37=\"\",\"\",'AS1'!D37)","v":""},{"$f":"IF('AS1'!E37=\"\",\"\",'AS1'!E37)","v":""},null,null,null,null,null,null,null,null,null,null,null,null,null,null,null,null,null,null,null,null,null,null,null,null,null,null,null,null,null,null,null,null,null,null,null,null,null,null,null,null,null,null,null,null,null,null,null,null,null,null,null,null,0,{"$f":"IF(PARCIAL1!L$8=0,0,(ROUND(((BF37*10)/PARCIAL2!L$8),1)))","v":0},null,null,{"$f":"IF(F37>$Y$3,0,F37)","v":0},0,0,0,0,0,0,0,0,0,0,0,0,0,0,0,0,0,0,0,0,0,0,0,0,0,0,0,0,0,0,0,{"$f":"IF(AL37>$Y$3,0,AL37)","v":0},0,0,0,0,0,0,0,0,0,0,0,0,0,0,0,0,0,0,0,{"$f":"IF(#REF!>$Y$3,0,#REF!)","v":{"$error":"#REF!"}},{"$f":"IF(#REF!>$Y$3,0,#REF!)","v":{"$error":"#REF!"}},{"$f":"IF(#REF!>$Y$3,0,#REF!)","v":{"$error":"#REF!"}},{"$f":"IF(#REF!>$Y$3,0,#REF!)","v":{"$error":"#REF!"}},{"$f":"IF(#REF!>$Y$3,0,#REF!)","v":{"$error":"#REF!"}},{"$f":"IF(#REF!>$Y$3,0,#REF!)","v":{"$error":"#REF!"}},{"$f":"IF(#REF!>$Y$3,0,#REF!)","v":{"$error":"#REF!"}},{"$f":"IF(#REF!>$Y$3,0,#REF!)","v":{"$error":"#REF!"}},{"$f":"IF(#REF!>$Y$3,0,#REF!)","v":{"$error":"#REF!"}},{"$f":"IF(#REF!>$Y$3,0,#REF!)","v":{"$error":"#REF!"}},{"$f":"IF(#REF!>$Y$3,0,#REF!)","v":{"$error":"#REF!"}},{"$f":"IF(#REF!>$Y$3,0,#REF!)","v":{"$error":"#REF!"}},{"$f":"IF(#REF!>$Y$3,0,#REF!)","v":{"$error":"#REF!"}},{"$f":"IF(#REF!>$Y$3,0,#REF!)","v":{"$error":"#REF!"}},{"$f":"IF(#REF!>$Y$3,0,#REF!)","v":{"$error":"#REF!"}},{"$f":"IF(#REF!>$Y$3,0,#REF!)","v":{"$error":"#REF!"}},{"$f":"IF(#REF!>$Y$3,0,#REF!)","v":{"$error":"#REF!"}},{"$f":"IF(#REF!>$Y$3,0,#REF!)","v":{"$error":"#REF!"}},{"$f":"IF(#REF!>$Y$3,0,#REF!)","v":{"$error":"#REF!"}},{"$f":"IF(#REF!>$Y$3,0,#REF!)","v":{"$error":"#REF!"}},{"$f":"IF(#REF!>$Y$3,0,#REF!)","v":{"$error":"#REF!"}},{"$f":"IF(#REF!>$Y$3,0,#REF!)","v":{"$error":"#REF!"}},{"$f":"IF(#REF!>$Y$3,0,#REF!)","v":{"$error":"#REF!"}},{"$f":"IF(#REF!>$Y$3,0,#REF!)","v":{"$error":"#REF!"}},{"$f":"IF(#REF!>$Y$3,0,#REF!)","v":{"$error":"#REF!"}},{"$f":"IF(#REF!>$Y$3,0,#REF!)","v":{"$error":"#REF!"}},{"$f":"IF(#REF!>$Y$3,0,#REF!)","v":{"$error":"#REF!"}},{"$f":"IF(#REF!>$Y$3,0,#REF!)","v":{"$error":"#REF!"}}]
[null,null,34,{"$f":"IF('AS1'!D38=\"\",\"\",'AS1'!D38)","v":""},{"$f":"IF('AS1'!E38=\"\",\"\",'AS1'!E38)","v":""},null,null,null,null,null,null,null,null,null,null,null,null,null,null,null,null,null,null,null,null,null,null,null,null,null,null,null,null,null,null,null,null,null,null,null,null,null,null,null,null,null,null,null,null,null,null,null,null,null,null,null,null,0,{"$f":"IF(PARCIAL1!L$8=0,0,(ROUND(((BF38*10)/PARCIAL2!L$8),1)))","v":0},null,null,0,0,0,0,0,0,0,0,0,0,0,0,0,0,0,0,0,0,0,0,0,0,0,0,0,0,0,0,0,0,0,{"$f":"IF(AK38>$Y$3,0,AK38)","v":0},0,0,0,0,0,0,0,0,0,0,0,0,0,0,0,0,0,0,0,0,{"$f":"IF(#REF!>$Y$3,0,#REF!)","v":{"$error":"#REF!"}},{"$f":"IF(#REF!>$Y$3,0,#REF!)","v":{"$error":"#REF!"}},{"$f":"IF(#REF!>$Y$3,0,#REF!)","v":{"$error":"#REF!"}},{"$f":"IF(#REF!>$Y$3,0,#REF!)","v":{"$error":"#REF!"}},{"$f":"IF(#REF!>$Y$3,0,#REF!)","v":{"$error":"#REF!"}},{"$f":"IF(#REF!>$Y$3,0,#REF!)","v":{"$error":"#REF!"}},{"$f":"IF(#REF!>$Y$3,0,#REF!)","v":{"$error":"#REF!"}},{"$f":"IF(#REF!>$Y$3,0,#REF!)","v":{"$error":"#REF!"}},{"$f":"IF(#REF!>$Y$3,0,#REF!)","v":{"$error":"#REF!"}},{"$f":"IF(#REF!>$Y$3,0,#REF!)","v":{"$error":"#REF!"}},{"$f":"IF(#REF!>$Y$3,0,#REF!)","v":{"$error":"#REF!"}},{"$f":"IF(#REF!>$Y$3,0,#REF!)","v":{"$error":"#REF!"}},{"$f":"IF(#REF!>$Y$3,0,#REF!)","v":{"$error":"#REF!"}},{"$f":"IF(#REF!>$Y$3,0,#REF!)","v":{"$error":"#REF!"}},{"$f":"IF(#REF!>$Y$3,0,#REF!)","v":{"$error":"#REF!"}},{"$f":"IF(#REF!>$Y$3,0,#REF!)","v":{"$error":"#REF!"}},{"$f":"IF(#REF!>$Y$3,0,#REF!)","v":{"$error":"#REF!"}},{"$f":"IF(#REF!>$Y$3,0,#REF!)","v":{"$error":"#REF!"}},{"$f":"IF(#REF!>$Y$3,0,#REF!)","v":{"$error":"#REF!"}},{"$f":"IF(#REF!>$Y$3,0,#REF!)","v":{"$error":"#REF!"}},{"$f":"IF(#REF!>$Y$3,0,#REF!)","v":{"$error":"#REF!"}},{"$f":"IF(#REF!>$Y$3,0,#REF!)","v":{"$error":"#REF!"}},{"$f":"IF(#REF!>$Y$3,0,#REF!)","v":{"$error":"#REF!"}},{"$f":"IF(#REF!>$Y$3,0,#REF!)","v":{"$error":"#REF!"}},{"$f":"IF(#REF!>$Y$3,0,#REF!)","v":{"$error":"#REF!"}},{"$f":"IF(#REF!>$Y$3,0,#REF!)","v":{"$error":"#REF!"}},{"$f":"IF(#REF!>$Y$3,0,#REF!)","v":{"$error":"#REF!"}},{"$f":"IF(#REF!>$Y$3,0,#REF!)","v":{"$error":"#REF!"}}]
[null,null,35,{"$f":"IF('AS1'!D39=\"\",\"\",'AS1'!D39)","v":""},{"$f":"IF('AS1'!E39=\"\",\"\",'AS1'!E39)","v":""},null,null,null,null,null,null,null,null,null,null,null,null,null,null,null,null,null,null,null,null,null,null,null,null,null,null,null,null,null,null,null,null,null,null,null,null,null,null,null,null,null,null,null,null,null,null,null,null,null,null,null,null,0,{"$f":"IF(PARCIAL1!L$8=0,0,(ROUND(((BF39*10)/PARCIAL2!L$8),1)))","v":0},null,null,0,0,0,0,0,0,0,0,0,0,0,0,0,0,0,0,0,0,0,0,0,0,0,0,0,0,0,0,0,0,0,0,0,0,0,0,0,0,0,0,0,0,0,0,0,0,0,0,0,0,0,0,{"$f":"IF(#REF!>$Y$3,0,#REF!)","v":{"$error":"#REF!"}},{"$f":"IF(#REF!>$Y$3,0,#REF!)","v":{"$error":"#REF!"}},{"$f":"IF(#REF!>$Y$3,0,#REF!)","v":{"$error":"#REF!"}},{"$f":"IF(#REF!>$Y$3,0,#REF!)","v":{"$error":"#REF!"}},{"$f":"IF(#REF!>$Y$3,0,#REF!)","v":{"$error":"#REF!"}},{"$f":"IF(#REF!>$Y$3,0,#REF!)","v":{"$error":"#REF!"}},{"$f":"IF(#REF!>$Y$3,0,#REF!)","v":{"$error":"#REF!"}},{"$f":"IF(#REF!>$Y$3,0,#REF!)","v":{"$error":"#REF!"}},{"$f":"IF(#REF!>$Y$3,0,#REF!)","v":{"$error":"#REF!"}},{"$f":"IF(#REF!>$Y$3,0,#REF!)","v":{"$error":"#REF!"}},{"$f":"IF(#REF!>$Y$3,0,#REF!)","v":{"$error":"#REF!"}},{"$f":"IF(#REF!>$Y$3,0,#REF!)","v":{"$error":"#REF!"}},{"$f":"IF(#REF!>$Y$3,0,#REF!)","v":{"$error":"#REF!"}},{"$f":"IF(#REF!>$Y$3,0,#REF!)","v":{"$error":"#REF!"}},{"$f":"IF(#REF!>$Y$3,0,#REF!)","v":{"$error":"#REF!"}},{"$f":"IF(#REF!>$Y$3,0,#REF!)","v":{"$error":"#REF!"}},{"$f":"IF(#REF!>$Y$3,0,#REF!)","v":{"$error":"#REF!"}},{"$f":"IF(#REF!>$Y$3,0,#REF!)","v":{"$error":"#REF!"}},{"$f":"IF(#REF!>$Y$3,0,#REF!)","v":{"$error":"#REF!"}},{"$f":"IF(#REF!>$Y$3,0,#REF!)","v":{"$error":"#REF!"}},{"$f":"IF(#REF!>$Y$3,0,#REF!)","v":{"$error":"#REF!"}},{"$f":"IF(#REF!>$Y$3,0,#REF!)","v":{"$error":"#REF!"}},{"$f":"IF(#REF!>$Y$3,0,#REF!)","v":{"$error":"#REF!"}},{"$f":"IF(#REF!>$Y$3,0,#REF!)","v":{"$error":"#REF!"}},{"$f":"IF(#REF!>$Y$3,0,#REF!)","v":{"$error":"#REF!"}},{"$f":"IF(#REF!>$Y$3,0,#REF!)","v":{"$error":"#REF!"}},{"$f":"IF(#REF!>$Y$3,0,#REF!)","v":{"$error":"#REF!"}},{"$f":"IF(#REF!>$Y$3,0,#REF!)","v":{"$error":"#REF!"}}]
[null,null,36,{"$f":"IF('AS1'!D40=\"\",\"\",'AS1'!D40)","v":""},{"$f":"IF('AS1'!E40=\"\",\"\",'AS1'!E40)","v":""},null,null,null,null,null,null,null,null,null,null,null,null,null,null,null,null,null,null,null,null,null,null,null,null,null,null,null,null,null,null,null,null,null,null,null,null,null,null,null,null,null,null,null,null,null,null,null,null,null,null,null,null,0,{"$f":"IF(PARCIAL1!L$8=0,0,(ROUND(((BF40*10)/PARCIAL2!L$8),1)))","v":0},null,null,0,0,0,0,0,0,0,0,0,0,0,0,0,0,0,0,0,0,0,0,0,0,0,0,0,0,0,0,0,0,0,0,0,0,0,0,0,0,0,0,0,0,0,0,0,0,0,0,0,0,0,0,{"$f":"IF(#REF!>$Y$3,0,#REF!)","v":{"$error":"#REF!"}},{"$f":"IF(#REF!>$Y$3,0,#REF!)","v":{"$error":"#REF!"}},{"$f":"IF(#REF!>$Y$3,0,#REF!)","v":{"$error":"#REF!"}},{"$f":"IF(#REF!>$Y$3,0,#REF!)","v":{"$error":"#REF!"}},{"$f":"IF(#REF!>$Y$3,0,#REF!)","v":{"$error":"#REF!"}},{"$f":"IF(#REF!>$Y$3,0,#REF!)","v":{"$error":"#REF!"}},{"$f":"IF(#REF!>$Y$3,0,#REF!)","v":{"$error":"#REF!"}},{"$f":"IF(#REF!>$Y$3,0,#REF!)","v":{"$error":"#REF!"}},{"$f":"IF(#REF!>$Y$3,0,#REF!)","v":{"$error":"#REF!"}},{"$f":"IF(#REF!>$Y$3,0,#REF!)","v":{"$error":"#REF!"}},{"$f":"IF(#REF!>$Y$3,0,#REF!)","v":{"$error":"#REF!"}},{"$f":"IF(#REF!>$Y$3,0,#REF!)","v":{"$error":"#REF!"}},{"$f":"IF(#REF!>$Y$3,0,#REF!)","v":{"$error":"#REF!"}},{"$f":"IF(#REF!>$Y$3,0,#REF!)","v":{"$error":"#REF!"}},{"$f":"IF(#REF!>$Y$3,0,#REF!)","v":{"$error":"#REF!"}},{"$f":"IF(#REF!>$Y$3,0,#REF!)","v":{"$error":"#REF!"}},{"$f":"IF(#REF!>$Y$3,0,#REF!)","v":{"$error":"#REF!"}},{"$f":"IF(#REF!>$Y$3,0,#REF!)","v":{"$error":"#REF!"}},{"$f":"IF(#REF!>$Y$3,0,#REF!)","v":{"$error":"#REF!"}},{"$f":"IF(#REF!>$Y$3,0,#REF!)","v":{"$error":"#REF!"}},{"$f":"IF(#REF!>$Y$3,0,#REF!)","v":{"$error":"#REF!"}},{"$f":"IF(#REF!>$Y$3,0,#REF!)","v":{"$error":"#REF!"}},{"$f":"IF(#REF!>$Y$3,0,#REF!)","v":{"$error":"#REF!"}},{"$f":"IF(#REF!>$Y$3,0,#REF!)","v":{"$error":"#REF!"}},{"$f":"IF(#REF!>$Y$3,0,#REF!)","v":{"$error":"#REF!"}},{"$f":"IF(#REF!>$Y$3,0,#REF!)","v":{"$error":"#REF!"}},{"$f":"IF(#REF!>$Y$3,0,#REF!)","v":{"$error":"#REF!"}},{"$f":"IF(#REF!>$Y$3,0,#REF!)","v":{"$error":"#REF!"}}]
[null,null,37,{"$f":"IF('AS1'!D41=\"\",\"\",'AS1'!D41)","v":""},{"$f":"IF('AS1'!E41=\"\",\"\",'AS1'!E41)","v":""},null,null,null,null,null,null,null,null,null,null,null,null,null,null,null,null,null,null,null,null,null,null,null,null,null,null,null,null,null,null,null,null,null,null,null,null,null,null,null,null,null,null,null,null,null,null,null,null,null,null,null,null,0,{"$f":"IF(PARCIAL1!L$8=0,0,(ROUND(((BF41*10)/PARCIAL2!L$8),1)))","v":0},null,null,0,0,0,0,0,0,0,0,0,0,0,0,0,0,0,0,0,0,0,0,0,0,0,0,0,0,0,0,0,0,0,0,0,0,0,0,0,0,0,0,0,0,0,0,0,0,0,0,0,0,0,0,{"$f":"IF(#REF!>$Y$3,0,#REF!)","v":{"$error":"#REF!"}},{"$f":"IF(#REF!>$Y$3,0,#REF!)","v":{"$error":"#REF!"}},{"$f":"IF(#REF!>$Y$3,0,#REF!)","v":{"$error":"#REF!"}},{"$f":"IF(#REF!>$Y$3,0,#REF!)","v":{"$error":"#REF!"}},{"$f":"IF(#REF!>$Y$3,0,#REF!)","v":{"$error":"#REF!"}},{"$f":"IF(#REF!>$Y$3,0,#REF!)","v":{"$error":"#REF!"}},{"$f":"IF(#REF!>$Y$3,0,#REF!)","v":{"$error":"#REF!"}},{"$f":"IF(#REF!>$Y$3,0,#REF!)","v":{"$error":"#REF!"}},{"$f":"IF(#REF!>$Y$3,0,#REF!)","v":{"$error":"#REF!"}},{"$f":"IF(#REF!>$Y$3,0,#REF!)","v":{"$error":"#REF!"}},{"$f":"IF(#REF!>$Y$3,0,#REF!)","v":{"$error":"#REF!"}},{"$f":"IF(#REF!>$Y$3,0,#REF!)","v":{"$error":"#REF!"}},{"$f":"IF(#REF!>$Y$3,0,#REF!)","v":{"$error":"#REF!"}},{"$f":"IF(#REF!>$Y$3,0,#REF!)","v":{"$error":"#REF!"}},{"$f":"IF(#REF!>$Y$3,0,#REF!)","v":{"$error":"#REF!"}},{"$f":"IF(#REF!>$Y$3,0,#REF!)","v":{"$error":"#REF!"}},{"$f":"IF(#REF!>$Y$3,0,#REF!)","v":{"$error":"#REF!"}},{"$f":"IF(#REF!>$Y$3,0,#REF!)","v":{"$error":"#REF!"}},{"$f":"IF(#REF!>$Y$3,0,#REF!)","v":{"$error":"#REF!"}},{"$f":"IF(#REF!>$Y$3,0,#REF!)","v":{"$error":"#REF!"}},{"$f":"IF(#REF!>$Y$3,0,#REF!)","v":{"$error":"#REF!"}},{"$f":"IF(#REF!>$Y$3,0,#REF!)","v":{"$error":"#REF!"}},{"$f":"IF(#REF!>$Y$3,0,#REF!)","v":{"$error":"#REF!"}},{"$f":"IF(#REF!>$Y$3,0,#REF!)","v":{"$error":"#REF!"}},{"$f":"IF(#REF!>$Y$3,0,#REF!)","v":{"$error":"#REF!"}},{"$f":"IF(#REF!>$Y$3,0,#REF!)","v":{"$error":"#REF!"}},{"$f":"IF(#REF!>$Y$3,0,#REF!)","v":{"$error":"#REF!"}},{"$f":"IF(#REF!>$Y$3,0,#REF!)","v":{"$error":"#REF!"}}]
[null,null,38,{"$f":"IF('AS1'!D42=\"\",\"\",'AS1'!D42)","v":""},{"$f":"IF('AS1'!E42=\"\",\"\",'AS1'!E42)","v":""},null,null,null,null,null,null,null,null,null,null,null,null,null,null,null,null,null,null,null,null,null,null,null,null,null,null,null,null,null,null,null,null,null,null,null,null,null,null,null,null,null,null,null,null,null,null,null,null,null,null,null,null,0,{"$f":"IF(PARCIAL1!L$8=0,0,(ROUND(((BF42*10)/PARCIAL2!L$8),1)))","v":0},null,null,0,0,0,0,0,0,0,0,0,0,0,0,0,0,0,0,0,0,0,0,0,0,0,0,0,0,0,0,0,0,0,0,0,0,0,0,0,0,0,0,0,0,0,0,0,0,0,0,0,0,0,0,{"$f":"IF(#REF!>$Y$3,0,#REF!)","v":{"$error":"#REF!"}},{"$f":"IF(#REF!>$Y$3,0,#REF!)","v":{"$error":"#REF!"}},{"$f":"IF(#REF!>$Y$3,0,#REF!)","v":{"$error":"#REF!"}},{"$f":"IF(#REF!>$Y$3,0,#REF!)","v":{"$error":"#REF!"}},{"$f":"IF(#REF!>$Y$3,0,#REF!)","v":{"$error":"#REF!"}},{"$f":"IF(#REF!>$Y$3,0,#REF!)","v":{"$error":"#REF!"}},{"$f":"IF(#REF!>$Y$3,0,#REF!)","v":{"$error":"#REF!"}},{"$f":"IF(#REF!>$Y$3,0,#REF!)","v":{"$error":"#REF!"}},{"$f":"IF(#REF!>$Y$3,0,#REF!)","v":{"$error":"#REF!"}},{"$f":"IF(#REF!>$Y$3,0,#REF!)","v":{"$error":"#REF!"}},{"$f":"IF(#REF!>$Y$3,0,#REF!)","v":{"$error":"#REF!"}},{"$f":"IF(#REF!>$Y$3,0,#REF!)","v":{"$error":"#REF!"}},{"$f":"IF(#REF!>$Y$3,0,#REF!)","v":{"$error":"#REF!"}},{"$f":"IF(#REF!>$Y$3,0,#REF!)","v":{"$error":"#REF!"}},{"$f":"IF(#REF!>$Y$3,0,#REF!)","v":{"$error":"#REF!"}},{"$f":"IF(#REF!>$Y$3,0,#REF!)","v":{"$error":"#REF!"}},{"$f":"IF(#REF!>$Y$3,0,#REF!)","v":{"$error":"#REF!"}},{"$f":"IF(#REF!>$Y$3,0,#REF!)","v":{"$error":"#REF!"}},{"$f":"IF(#REF!>$Y$3,0,#REF!)","v":{"$error":"#REF!"}},{"$f":"IF(#REF!>$Y$3,0,#REF!)","v":{"$error":"#REF!"}},{"$f":"IF(#REF!>$Y$3,0,#REF!)","v":{"$error":"#REF!"}},{"$f":"IF(#REF!>$Y$3,0,#REF!)","v":{"$error":"#REF!"}},{"$f":"IF(#REF!>$Y$3,0,#REF!)","v":{"$error":"#REF!"}},{"$f":"IF(#REF!>$Y$3,0,#REF!)","v":{"$error":"#REF!"}},{"$f":"IF(#REF!>$Y$3,0,#REF!)","v":{"$error":"#REF!"}},{"$f":"IF(#REF!>$Y$3,0,#REF!)","v":{"$error":"#REF!"}},{"$f":"IF(#REF!>$Y$3,0,#REF!)","v":{"$error":"#REF!"}},{"$f":"IF(#REF!>$Y$3,0,#REF!)","v":{"$error":"#REF!"}}]
[null,null,39,{"$f":"IF('AS1'!D43=\"\",\"\",'AS1'!D43)","v":""},{"$f":"IF('AS1'!E43=\"\",\"\",'AS1'!E43)","v":""},null,null,null,null,null,null,null,null,null,null,null,null,null,null,null,null,null,null,null,null,null,null,null,null,null,null,null,null,null,null,null,null,null,null,null,null,null,null,null,null,null,null,null,null,null,null,null,null,null,null,null,null,0,{"$f":"IF(PARCIAL1!L$8=0,0,(ROUND(((BF43*10)/PARCIAL2!L$8),1)))","v":0},null,null,0,0,0,0,0,0,0,0,0,0,0,0,0,0,0,0,0,0,0,0,0,0,0,0,0,0,0,0,0,0,0,0,0,0,0,0,0,0,0,0,0,0,0,0,0,0,0,0,0,0,0,0,{"$f":"IF(#REF!>$Y$3,0,#REF!)","v":{"$error":"#REF!"}},{"$f":"IF(#REF!>$Y$3,0,#REF!)","v":{"$error":"#REF!"}},{"$f":"IF(#REF!>$Y$3,0,#REF!)","v":{"$error":"#REF!"}},{"$f":"IF(#REF!>$Y$3,0,#REF!)","v":{"$error":"#REF!"}},{"$f":"IF(#REF!>$Y$3,0,#REF!)","v":{"$error":"#REF!"}},{"$f":"IF(#REF!>$Y$3,0,#REF!)","v":{"$error":"#REF!"}},{"$f":"IF(#REF!>$Y$3,0,#REF!)","v":{"$error":"#REF!"}},{"$f":"IF(#REF!>$Y$3,0,#REF!)","v":{"$error":"#REF!"}},{"$f":"IF(#REF!>$Y$3,0,#REF!)","v":{"$error":"#REF!"}},{"$f":"IF(#REF!>$Y$3,0,#REF!)","v":{"$error":"#REF!"}},{"$f":"IF(#REF!>$Y$3,0,#REF!)","v":{"$error":"#REF!"}},{"$f":"IF(#REF!>$Y$3,0,#REF!)","v":{"$error":"#REF!"}},{"$f":"IF(#REF!>$Y$3,0,#REF!)","v":{"$error":"#REF!"}},{"$f":"IF(#REF!>$Y$3,0,#REF!)","v":{"$error":"#REF!"}},{"$f":"IF(#REF!>$Y$3,0,#REF!)","v":{"$error":"#REF!"}},{"$f":"IF(#REF!>$Y$3,0,#REF!)","v":{"$error":"#REF!"}},{"$f":"IF(#REF!>$Y$3,0,#REF!)","v":{"$error":"#REF!"}},{"$f":"IF(#REF!>$Y$3,0,#REF!)","v":{"$error":"#REF!"}},{"$f":"IF(#REF!>$Y$3,0,#REF!)","v":{"$error":"#REF!"}},{"$f":"IF(#REF!>$Y$3,0,#REF!)","v":{"$error":"#REF!"}},{"$f":"IF(#REF!>$Y$3,0,#REF!)","v":{"$error":"#REF!"}},{"$f":"IF(#REF!>$Y$3,0,#REF!)","v":{"$error":"#REF!"}},{"$f":"IF(#REF!>$Y$3,0,#REF!)","v":{"$error":"#REF!"}},{"$f":"IF(#REF!>$Y$3,0,#REF!)","v":{"$error":"#REF!"}},{"$f":"IF(#REF!>$Y$3,0,#REF!)","v":{"$error":"#REF!"}},{"$f":"IF(#REF!>$Y$3,0,#REF!)","v":{"$error":"#REF!"}},{"$f":"IF(#REF!>$Y$3,0,#REF!)","v":{"$error":"#REF!"}},{"$f":"IF(#REF!>$Y$3,0,#REF!)","v":{"$error":"#REF!"}}]
[null,null,40,{"$f":"IF('AS1'!D44=\"\",\"\",'AS1'!D44)","v":""},{"$f":"IF('AS1'!E44=\"\",\"\",'AS1'!E44)","v":""},null,null,null,null,null,null,null,null,null,null,null,null,null,null,null,null,null,null,null,null,null,null,null,null,null,null,null,null,null,null,null,null,null,null,null,null,null,null,null,null,null,null,null,null,null,null,null,null,null,null,null,null,0,{"$f":"IF(PARCIAL1!L$8=0,0,(ROUND(((BF44*10)/PARCIAL2!L$8),1)))","v":0},null,null,0,0,0,0,0,0,0,0,0,0,0,0,0,0,0,0,0,0,0,0,0,0,0,0,0,0,0,0,0,0,0,0,0,0,0,0,0,0,0,0,0,0,0,0,0,0,0,0,0,0,0,0,{"$f":"IF(#REF!>$Y$3,0,#REF!)","v":{"$error":"#REF!"}},{"$f":"IF(#REF!>$Y$3,0,#REF!)","v":{"$error":"#REF!"}},{"$f":"IF(#REF!>$Y$3,0,#REF!)","v":{"$error":"#REF!"}},{"$f":"IF(#REF!>$Y$3,0,#REF!)","v":{"$error":"#REF!"}},{"$f":"IF(#REF!>$Y$3,0,#REF!)","v":{"$error":"#REF!"}},{"$f":"IF(#REF!>$Y$3,0,#REF!)","v":{"$error":"#REF!"}},{"$f":"IF(#REF!>$Y$3,0,#REF!)","v":{"$error":"#REF!"}},{"$f":"IF(#REF!>$Y$3,0,#REF!)","v":{"$error":"#REF!"}},{"$f":"IF(#REF!>$Y$3,0,#REF!)","v":{"$error":"#REF!"}},{"$f":"IF(#REF!>$Y$3,0,#REF!)","v":{"$error":"#REF!"}},{"$f":"IF(#REF!>$Y$3,0,#REF!)","v":{"$error":"#REF!"}},{"$f":"IF(#REF!>$Y$3,0,#REF!)","v":{"$error":"#REF!"}},{"$f":"IF(#REF!>$Y$3,0,#REF!)","v":{"$error":"#REF!"}},{"$f":"IF(#REF!>$Y$3,0,#REF!)","v":{"$error":"#REF!"}},{"$f":"IF(#REF!>$Y$3,0,#REF!)","v":{"$error":"#REF!"}},{"$f":"IF(#REF!>$Y$3,0,#REF!)","v":{"$error":"#REF!"}},{"$f":"IF(#REF!>$Y$3,0,#REF!)","v":{"$error":"#REF!"}},{"$f":"IF(#REF!>$Y$3,0,#REF!)","v":{"$error":"#REF!"}},{"$f":"IF(#REF!>$Y$3,0,#REF!)","v":{"$error":"#REF!"}},{"$f":"IF(#REF!>$Y$3,0,#REF!)","v":{"$error":"#REF!"}},{"$f":"IF(#REF!>$Y$3,0,#REF!)","v":{"$error":"#REF!"}},{"$f":"IF(#REF!>$Y$3,0,#REF!)","v":{"$error":"#REF!"}},{"$f":"IF(#REF!>$Y$3,0,#REF!)","v":{"$error":"#REF!"}},{"$f":"IF(#REF!>$Y$3,0,#REF!)","v":{"$error":"#REF!"}},{"$f":"IF(#REF!>$Y$3,0,#REF!)","v":{"$error":"#REF!"}},{"$f":"IF(#REF!>$Y$3,0,#REF!)","v":{"$error":"#REF!"}},{"$f":"IF(#REF!>$Y$3,0,#REF!)","v":{"$error":"#REF!"}},{"$f":"IF(#REF!>$Y$3,0,#REF!)","v":{"$error":"#REF!"}}]
[null,null,41,{"$f":"IF('AS1'!D45=\"\",\"\",'AS1'!D45)","v":""},{"$f":"IF('AS1'!E45=\"\",\"\",'AS1'!E45)","v":""},null,null,null,null,null,null,null,null,null,null,null,null,null,null,null,null,null,null,null,null,null,null,null,null,null,null,null,null,null,null,null,null,null,null,null,null,null,null,null,null,null,null,null,null,null,null,null,null,null,null,null,null,0,{"$f":"IF(PARCIAL1!L$8=0,0,(ROUND(((BF45*10)/PARCIAL2!L$8),1)))","v":0},null,null,0,0,0,0,0,0,0,0,0,0,0,0,0,0,0,0,0,0,0,0,0,0,0,0,0,0,0,0,0,0,0,0,0,0,0,0,0,0,0,0,0,0,0,0,0,0,0,0,0,0,0,0,{"$f":"IF(#REF!>$Y$3,0,#REF!)","v":{"$error":"#REF!"}},{"$f":"IF(#REF!>$Y$3,0,#REF!)","v":{"$error":"#REF!"}},{"$f":"IF(#REF!>$Y$3,0,#REF!)","v":{"$error":"#REF!"}},{"$f":"IF(#REF!>$Y$3,0,#REF!)","v":{"$error":"#REF!"}},{"$f":"IF(#REF!>$Y$3,0,#REF!)","v":{"$error":"#REF!"}},{"$f":"IF(#REF!>$Y$3,0,#REF!)","v":{"$error":"#REF!"}},{"$f":"IF(#REF!>$Y$3,0,#REF!)","v":{"$error":"#REF!"}},{"$f":"IF(#REF!>$Y$3,0,#REF!)","v":{"$error":"#REF!"}},{"$f":"IF(#REF!>$Y$3,0,#REF!)","v":{"$error":"#REF!"}},{"$f":"IF(#REF!>$Y$3,0,#REF!)","v":{"$error":"#REF!"}},{"$f":"IF(#REF!>$Y$3,0,#REF!)","v":{"$error":"#REF!"}},{"$f":"IF(#REF!>$Y$3,0,#REF!)","v":{"$error":"#REF!"}},{"$f":"IF(#REF!>$Y$3,0,#REF!)","v":{"$error":"#REF!"}},{"$f":"IF(#REF!>$Y$3,0,#REF!)","v":{"$error":"#REF!"}},{"$f":"IF(#REF!>$Y$3,0,#REF!)","v":{"$error":"#REF!"}},{"$f":"IF(#REF!>$Y$3,0,#REF!)","v":{"$error":"#REF!"}},{"$f":"IF(#REF!>$Y$3,0,#REF!)","v":{"$error":"#REF!"}},{"$f":"IF(#REF!>$Y$3,0,#REF!)","v":{"$error":"#REF!"}},{"$f":"IF(#REF!>$Y$3,0,#REF!)","v":{"$error":"#REF!"}},{"$f":"IF(#REF!>$Y$3,0,#REF!)","v":{"$error":"#REF!"}},{"$f":"IF(#REF!>$Y$3,0,#REF!)","v":{"$error":"#REF!"}},{"$f":"IF(#REF!>$Y$3,0,#REF!)","v":{"$error":"#REF!"}},{"$f":"IF(#REF!>$Y$3,0,#REF!)","v":{"$error":"#REF!"}},{"$f":"IF(#REF!>$Y$3,0,#REF!)","v":{"$error":"#REF!"}},{"$f":"IF(#REF!>$Y$3,0,#REF!)","v":{"$error":"#REF!"}},{"$f":"IF(#REF!>$Y$3,0,#REF!)","v":{"$error":"#REF!"}},{"$f":"IF(#REF!>$Y$3,0,#REF!)","v":{"$error":"#REF!"}},{"$f":"IF(#REF!>$Y$3,0,#REF!)","v":{"$error":"#REF!"}}]
[null,null,42,{"$f":"IF('AS1'!D46=\"\",\"\",'AS1'!D46)","v":""},{"$f":"IF('AS1'!E46=\"\",\"\",'AS1'!E46)","v":""},null,null,null,null,null,null,null,null,null,null,null,null,null,null,null,null,null,null,null,null,null,null,null,null,null,null,null,null,null,null,null,null,null,null,null,null,null,null,null,null,null,null,null,null,null,null,null,null,null,null,null,null,0,{"$f":"IF(PARCIAL1!L$8=0,0,(ROUND(((BF46*10)/PARCIAL2!L$8),1)))","v":0},null,null,0,0,0,0,0,0,0,0,0,0,0,0,0,0,0,0,0,0,0,0,0,0,0,0,0,0,0,0,0,0,0,0,0,0,0,0,0,0,0,0,0,0,0,0,0,0,0,0,0,0,0,0,{"$f":"IF(#REF!>$Y$3,0,#REF!)","v":{"$error":"#REF!"}},{"$f":"IF(#REF!>$Y$3,0,#REF!)","v":{"$error":"#REF!"}},{"$f":"IF(#REF!>$Y$3,0,#REF!)","v":{"$error":"#REF!"}},{"$f":"IF(#REF!>$Y$3,0,#REF!)","v":{"$error":"#REF!"}},{"$f":"IF(#REF!>$Y$3,0,#REF!)","v":{"$error":"#REF!"}},{"$f":"IF(#REF!>$Y$3,0,#REF!)","v":{"$error":"#REF!"}},{"$f":"IF(#REF!>$Y$3,0,#REF!)","v":{"$error":"#REF!"}},{"$f":"IF(#REF!>$Y$3,0,#REF!)","v":{"$error":"#REF!"}},{"$f":"IF(#REF!>$Y$3,0,#REF!)","v":{"$error":"#REF!"}},{"$f":"IF(#REF!>$Y$3,0,#REF!)","v":{"$error":"#REF!"}},{"$f":"IF(#REF!>$Y$3,0,#REF!)","v":{"$error":"#REF!"}},{"$f":"IF(#REF!>$Y$3,0,#REF!)","v":{"$error":"#REF!"}},{"$f":"IF(#REF!>$Y$3,0,#REF!)","v":{"$error":"#REF!"}},{"$f":"IF(#REF!>$Y$3,0,#REF!)","v":{"$error":"#REF!"}},{"$f":"IF(#REF!>$Y$3,0,#REF!)","v":{"$error":"#REF!"}},{"$f":"IF(#REF!>$Y$3,0,#REF!)","v":{"$error":"#REF!"}},{"$f":"IF(#REF!>$Y$3,0,#REF!)","v":{"$error":"#REF!"}},{"$f":"IF(#REF!>$Y$3,0,#REF!)","v":{"$error":"#REF!"}},{"$f":"IF(#REF!>$Y$3,0,#REF!)","v":{"$error":"#REF!"}},{"$f":"IF(#REF!>$Y$3,0,#REF!)","v":{"$error":"#REF!"}},{"$f":"IF(#REF!>$Y$3,0,#REF!)","v":{"$error":"#REF!"}},{"$f":"IF(#REF!>$Y$3,0,#REF!)","v":{"$error":"#REF!"}},{"$f":"IF(#REF!>$Y$3,0,#REF!)","v":{"$error":"#REF!"}},{"$f":"IF(#REF!>$Y$3,0,#REF!)","v":{"$error":"#REF!"}},{"$f":"IF(#REF!>$Y$3,0,#REF!)","v":{"$error":"#REF!"}},{"$f":"IF(#REF!>$Y$3,0,#REF!)","v":{"$error":"#REF!"}},{"$f":"IF(#REF!>$Y$3,0,#REF!)","v":{"$error":"#REF!"}},{"$f":"IF(#REF!>$Y$3,0,#REF!)","v":{"$error":"#REF!"}}]
[null,null,43,{"$f":"IF('AS1'!D47=\"\",\"\",'AS1'!D47)","v":""},{"$f":"IF('AS1'!E47=\"\",\"\",'AS1'!E47)","v":""},null,null,null,null,null,null,null,null,null,null,null,null,null,null,null,null,null,null,null,null,null,null,null,null,null,null,null,null,null,null,null,null,null,null,null,null,null,null,null,null,null,null,null,null,null,null,null,null,null,null,null,null,0,{"$f":"IF(PARCIAL1!L$8=0,0,(ROUND(((BF47*10)/PARCIAL2!L$8),1)))","v":0},null,null,0,0,0,0,0,0,0,0,0,0,0,0,0,0,0,0,0,0,0,0,0,0,0,0,0,0,0,0,0,0,0,0,0,0,0,0,0,0,0,0,0,0,0,0,0,0,0,0,0,0,0,0,{"$f":"IF(#REF!>$Y$3,0,#REF!)","v":{"$error":"#REF!"}},{"$f":"IF(#REF!>$Y$3,0,#REF!)","v":{"$error":"#REF!"}},{"$f":"IF(#REF!>$Y$3,0,#REF!)","v":{"$error":"#REF!"}},{"$f":"IF(#REF!>$Y$3,0,#REF!)","v":{"$error":"#REF!"}},{"$f":"IF(#REF!>$Y$3,0,#REF!)","v":{"$error":"#REF!"}},{"$f":"IF(#REF!>$Y$3,0,#REF!)","v":{"$error":"#REF!"}},{"$f":"IF(#REF!>$Y$3,0,#REF!)","v":{"$error":"#REF!"}},{"$f":"IF(#REF!>$Y$3,0,#REF!)","v":{"$error":"#REF!"}},{"$f":"IF(#REF!>$Y$3,0,#REF!)","v":{"$error":"#REF!"}},{"$f":"IF(#REF!>$Y$3,0,#REF!)","v":{"$error":"#REF!"}},{"$f":"IF(#REF!>$Y$3,0,#REF!)","v":{"$error":"#REF!"}},{"$f":"IF(#REF!>$Y$3,0,#REF!)","v":{"$error":"#REF!"}},{"$f":"IF(#REF!>$Y$3,0,#REF!)","v":{"$error":"#REF!"}},{"$f":"IF(#REF!>$Y$3,0,#REF!)","v":{"$error":"#REF!"}},{"$f":"IF(#REF!>$Y$3,0,#REF!)","v":{"$error":"#REF!"}},{"$f":"IF(#REF!>$Y$3,0,#REF!)","v":{"$error":"#REF!"}},{"$f":"IF(#REF!>$Y$3,0,#REF!)","v":{"$error":"#REF!"}},{"$f":"IF(#REF!>$Y$3,0,#REF!)","v":{"$error":"#REF!"}},{"$f":"IF(#REF!>$Y$3,0,#REF!)","v":{"$error":"#REF!"}},{"$f":"IF(#REF!>$Y$3,0,#REF!)","v":{"$error":"#REF!"}},{"$f":"IF(#REF!>$Y$3,0,#REF!)","v":{"$error":"#REF!"}},{"$f":"IF(#REF!>$Y$3,0,#REF!)","v":{"$error":"#REF!"}},{"$f":"IF(#REF!>$Y$3,0,#REF!)","v":{"$error":"#REF!"}},{"$f":"IF(#REF!>$Y$3,0,#REF!)","v":{"$error":"#REF!"}},{"$f":"IF(#REF!>$Y$3,0,#REF!)","v":{"$error":"#REF!"}},{"$f":"IF(#REF!>$Y$3,0,#REF!)","v":{"$error":"#REF!"}},{"$f":"IF(#REF!>$Y$3,0,#REF!)","v":{"$error":"#REF!"}},{"$f":"IF(#REF!>$Y$3,0,#REF!)","v":{"$error":"#REF!"}}]
[null,null,44,{"$f":"IF('AS1'!D48=\"\",\"\",'AS1'!D48)","v":""},{"$f":"IF('AS1'!E48=\"\",\"\",'AS1'!E48)","v":""},null,null,null,null,null,null,null,null,null,null,null,null,null,null,null,null,null,null,null,null,null,null,null,null,null,null,null,null,null,null,null,null,null,null,null,null,null,null,null,null,null,null,null,null,null,null,null,null,null,null,null,null,0,{"$f":"IF(PARCIAL1!L$8=0,0,(ROUND(((BF48*10)/PARCIAL2!L$8),1)))","v":0},null,null,0,0,0,0,0,0,0,0,0,0,0,0,0,0,0,0,0,0,0,0,0,0,0,0,0,0,0,0,0,0,0,0,0,0,0,0,0,0,0,0,0,0,0,0,0,0,0,0,0,0,0,0,{"$f":"IF(#REF!>$Y$3,0,#REF!)","v":{"$error":"#REF!"}},{"$f":"IF(#REF!>$Y$3,0,#REF!)","v":{"$error":"#REF!"}},{"$f":"IF(#REF!>$Y$3,0,#REF!)","v":{"$error":"#REF!"}},{"$f":"IF(#REF!>$Y$3,0,#REF!)","v":{"$error":"#REF!"}},{"$f":"IF(#REF!>$Y$3,0,#REF!)","v":{"$error":"#REF!"}},{"$f":"IF(#REF!>$Y$3,0,#REF!)","v":{"$error":"#REF!"}},{"$f":"IF(#REF!>$Y$3,0,#REF!)","v":{"$error":"#REF!"}},{"$f":"IF(#REF!>$Y$3,0,#REF!)","v":{"$error":"#REF!"}},{"$f":"IF(#REF!>$Y$3,0,#REF!)","v":{"$error":"#REF!"}},{"$f":"IF(#REF!>$Y$3,0,#REF!)","v":{"$error":"#REF!"}},{"$f":"IF(#REF!>$Y$3,0,#REF!)","v":{"$error":"#REF!"}},{"$f":"IF(#REF!>$Y$3,0,#REF!)","v":{"$error":"#REF!"}},{"$f":"IF(#REF!>$Y$3,0,#REF!)","v":{"$error":"#REF!"}},{"$f":"IF(#REF!>$Y$3,0,#REF!)","v":{"$error":"#REF!"}},{"$f":"IF(#REF!>$Y$3,0,#REF!)","v":{"$error":"#REF!"}},{"$f":"IF(#REF!>$Y$3,0,#REF!)","v":{"$error":"#REF!"}},{"$f":"IF(#REF!>$Y$3,0,#REF!)","v":{"$error":"#REF!"}},{"$f":"IF(#REF!>$Y$3,0,#REF!)","v":{"$error":"#REF!"}},{"$f":"IF(#REF!>$Y$3,0,#REF!)","v":{"$error":"#REF!"}},{"$f":"IF(#REF!>$Y$3,0,#REF!)","v":{"$error":"#REF!"}},{"$f":"IF(#REF!>$Y$3,0,#REF!)","v":{"$error":"#REF!"}},{"$f":"IF(#REF!>$Y$3,0,#REF!)","v":{"$error":"#REF!"}},{"$f":"IF(#REF!>$Y$3,0,#REF!)","v":{"$error":"#REF!"}},{"$f":"IF(#REF!>$Y$3,0,#REF!)","v":{"$error":"#REF!"}},{"$f":"IF(#REF!>$Y$3,0,#REF!)","v":{"$error":"#REF!"}},{"$f":"IF(#REF!>$Y$3,0,#REF!)","v":{"$error":"#REF!"}},{"$f":"IF(#REF!>$Y$3,0,#REF!)","v":{"$error":"#REF!"}},{"$f":"IF(#REF!>$Y$3,0,#REF!)","v":{"$error":"#REF!"}}]
[null,null,45,{"$f":"IF('AS1'!D49=\"\",\"\",'AS1'!D49)","v":""},{"$f":"IF('AS1'!E49=\"\",\"\",'AS1'!E49)","v":""},null,null,null,null,null,null,null,null,null,null,null,null,null,null,null,null,null,null,null,null,null,null,null,null,null,null,null,null,null,null,null,null,null,null,null,null,null,null,null,null,null,null,null,null,null,null,null,null,null,null,null,null,0,{"$f":"IF(PARCIAL1!L$8=0,0,(ROUND(((BF49*10)/PARCIAL2!L$8),1)))","v":0},null,null,0,0,0,0,0,0,0,0,0,0,0,0,0,0,0,0,0,0,0,0,0,0,0,0,0,0,0,0,0,0,0,0,0,0,0,0,0,0,0,0,0,0,0,0,0,0,0,0,0,0,0,0,{"$f":"IF(#REF!>$Y$3,0,#REF!)","v":{"$error":"#REF!"}},{"$f":"IF(#REF!>$Y$3,0,#REF!)","v":{"$error":"#REF!"}},{"$f":"IF(#REF!>$Y$3,0,#REF!)","v":{"$error":"#REF!"}},{"$f":"IF(#REF!>$Y$3,0,#REF!)","v":{"$error":"#REF!"}},{"$f":"IF(#REF!>$Y$3,0,#REF!)","v":{"$error":"#REF!"}},{"$f":"IF(#REF!>$Y$3,0,#REF!)","v":{"$error":"#REF!"}},{"$f":"IF(#REF!>$Y$3,0,#REF!)","v":{"$error":"#REF!"}},{"$f":"IF(#REF!>$Y$3,0,#REF!)","v":{"$error":"#REF!"}},{"$f":"IF(#REF!>$Y$3,0,#REF!)","v":{"$error":"#REF!"}},{"$f":"IF(#REF!>$Y$3,0,#REF!)","v":{"$error":"#REF!"}},{"$f":"IF(#REF!>$Y$3,0,#REF!)","v":{"$error":"#REF!"}},{"$f":"IF(#REF!>$Y$3,0,#REF!)","v":{"$error":"#REF!"}},{"$f":"IF(#REF!>$Y$3,0,#REF!)","v":{"$error":"#REF!"}},{"$f":"IF(#REF!>$Y$3,0,#REF!)","v":{"$error":"#REF!"}},{"$f":"IF(#REF!>$Y$3,0,#REF!)","v":{"$error":"#REF!"}},{"$f":"IF(#REF!>$Y$3,0,#REF!)","v":{"$error":"#REF!"}},{"$f":"IF(#REF!>$Y$3,0,#REF!)","v":{"$error":"#REF!"}},{"$f":"IF(#REF!>$Y$3,0,#REF!)","v":{"$error":"#REF!"}},{"$f":"IF(#REF!>$Y$3,0,#REF!)","v":{"$error":"#REF!"}},{"$f":"IF(#REF!>$Y$3,0,#REF!)","v":{"$error":"#REF!"}},{"$f":"IF(#REF!>$Y$3,0,#REF!)","v":{"$error":"#REF!"}},{"$f":"IF(#REF!>$Y$3,0,#REF!)","v":{"$error":"#REF!"}},{"$f":"IF(#REF!>$Y$3,0,#REF!)","v":{"$error":"#REF!"}},{"$f":"IF(#REF!>$Y$3,0,#REF!)","v":{"$error":"#REF!"}},{"$f":"IF(#REF!>$Y$3,0,#REF!)","v":{"$error":"#REF!"}},{"$f":"IF(#REF!>$Y$3,0,#REF!)","v":{"$error":"#REF!"}},{"$f":"IF(#REF!>$Y$3,0,#REF!)","v":{"$error":"#REF!"}},{"$f":"IF(#REF!>$Y$3,0,#REF!)","v":{"$error":"#REF!"}}]
[null,null,46,{"$f":"IF('AS1'!D50=\"\",\"\",'AS1'!D50)","v":""},{"$f":"IF('AS1'!E50=\"\",\"\",'AS1'!E50)","v":""},null,null,null,null,null,null,null,null,null,null,null,null,null,null,null,null,null,null,null,null,null,null,null,null,null,null,null,null,null,null,null,null,null,null,null,null,null,null,null,null,null,null,null,null,null,null,null,null,null,null,null,null,0,{"$f":"IF(PARCIAL1!L$8=0,0,(ROUND(((BF50*10)/PARCIAL2!L$8),1)))","v":0},null,null,0,0,0,0,0,0,0,0,0,0,0,0,0,0,0,0,0,0,0,0,0,0,0,0,0,0,0,0,0,0,0,0,0,0,0,0,0,0,0,0,0,0,0,0,0,0,0,0,0,0,0,0,{"$f":"IF(#REF!>$Y$3,0,#REF!)","v":{"$error":"#REF!"}},{"$f":"IF(#REF!>$Y$3,0,#REF!)","v":{"$error":"#REF!"}},{"$f":"IF(#REF!>$Y$3,0,#REF!)","v":{"$error":"#REF!"}},{"$f":"IF(#REF!>$Y$3,0,#REF!)","v":{"$error":"#REF!"}},{"$f":"IF(#REF!>$Y$3,0,#REF!)","v":{"$error":"#REF!"}},{"$f":"IF(#REF!>$Y$3,0,#REF!)","v":{"$error":"#REF!"}},{"$f":"IF(#REF!>$Y$3,0,#REF!)","v":{"$error":"#REF!"}},{"$f":"IF(#REF!>$Y$3,0,#REF!)","v":{"$error":"#REF!"}},{"$f":"IF(#REF!>$Y$3,0,#REF!)","v":{"$error":"#REF!"}},{"$f":"IF(#REF!>$Y$3,0,#REF!)","v":{"$error":"#REF!"}},{"$f":"IF(#REF!>$Y$3,0,#REF!)","v":{"$error":"#REF!"}},{"$f":"IF(#REF!>$Y$3,0,#REF!)","v":{"$error":"#REF!"}},{"$f":"IF(#REF!>$Y$3,0,#REF!)","v":{"$error":"#REF!"}},{"$f":"IF(#REF!>$Y$3,0,#REF!)","v":{"$error":"#REF!"}},{"$f":"IF(#REF!>$Y$3,0,#REF!)","v":{"$error":"#REF!"}},{"$f":"IF(#REF!>$Y$3,0,#REF!)","v":{"$error":"#REF!"}},{"$f":"IF(#REF!>$Y$3,0,#REF!)","v":{"$error":"#REF!"}},{"$f":"IF(#REF!>$Y$3,0,#REF!)","v":{"$error":"#REF!"}},{"$f":"IF(#REF!>$Y$3,0,#REF!)","v":{"$error":"#REF!"}},{"$f":"IF(#REF!>$Y$3,0,#REF!)","v":{"$error":"#REF!"}},{"$f":"IF(#REF!>$Y$3,0,#REF!)","v":{"$error":"#REF!"}},{"$f":"IF(#REF!>$Y$3,0,#REF!)","v":{"$error":"#REF!"}},{"$f":"IF(#REF!>$Y$3,0,#REF!)","v":{"$error":"#REF!"}},{"$f":"IF(#REF!>$Y$3,0,#REF!)","v":{"$error":"#REF!"}},{"$f":"IF(#REF!>$Y$3,0,#REF!)","v":{"$error":"#REF!"}},{"$f":"IF(#REF!>$Y$3,0,#REF!)","v":{"$error":"#REF!"}},{"$f":"IF(#REF!>$Y$3,0,#REF!)","v":{"$error":"#REF!"}},{"$f":"IF(#REF!>$Y$3,0,#REF!)","v":{"$error":"#REF!"}}]
[null,null,47,{"$f":"IF('AS1'!D51=\"\",\"\",'AS1'!D51)","v":""},{"$f":"IF('AS1'!E51=\"\",\"\",'AS1'!E51)","v":""},null,null,null,null,null,null,null,null,null,null,null,null,null,null,null,null,null,null,null,null,null,null,null,null,null,null,null,null,null,null,null,null,null,null,null,null,null,null,null,null,null,null,null,null,null,null,null,null,null,null,null,null,0,{"$f":"IF(PARCIAL1!L$8=0,0,(ROUND(((BF51*10)/PARCIAL2!L$8),1)))","v":0},null,null,0,0,0,0,0,0,0,0,0,0,0,0,0,0,0,0,0,0,0,0,0,0,0,0,0,0,0,0,0,0,0,0,0,0,0,0,0,0,0,0,0,0,0,0,0,0,0,0,0,0,0,0,{"$f":"IF(#REF!>$Y$3,0,#REF!)","v":{"$error":"#REF!"}},{"$f":"IF(#REF!>$Y$3,0,#REF!)","v":{"$error":"#REF!"}},{"$f":"IF(#REF!>$Y$3,0,#REF!)","v":{"$error":"#REF!"}},{"$f":"IF(#REF!>$Y$3,0,#REF!)","v":{"$error":"#REF!"}},{"$f":"IF(#REF!>$Y$3,0,#REF!)","v":{"$error":"#REF!"}},{"$f":"IF(#REF!>$Y$3,0,#REF!)","v":{"$error":"#REF!"}},{"$f":"IF(#REF!>$Y$3,0,#REF!)","v":{"$error":"#REF!"}},{"$f":"IF(#REF!>$Y$3,0,#REF!)","v":{"$error":"#REF!"}},{"$f":"IF(#REF!>$Y$3,0,#REF!)","v":{"$error":"#REF!"}},{"$f":"IF(#REF!>$Y$3,0,#REF!)","v":{"$error":"#REF!"}},{"$f":"IF(#REF!>$Y$3,0,#REF!)","v":{"$error":"#REF!"}},{"$f":"IF(#REF!>$Y$3,0,#REF!)","v":{"$error":"#REF!"}},{"$f":"IF(#REF!>$Y$3,0,#REF!)","v":{"$error":"#REF!"}},{"$f":"IF(#REF!>$Y$3,0,#REF!)","v":{"$error":"#REF!"}},{"$f":"IF(#REF!>$Y$3,0,#REF!)","v":{"$error":"#REF!"}},{"$f":"IF(#REF!>$Y$3,0,#REF!)","v":{"$error":"#REF!"}},{"$f":"IF(#REF!>$Y$3,0,#REF!)","v":{"$error":"#REF!"}},{"$f":"IF(#REF!>$Y$3,0,#REF!)","v":{"$error":"#REF!"}},{"$f":"IF(#REF!>$Y$3,0,#REF!)","v":{"$error":"#REF!"}},{"$f":"IF(#REF!>$Y$3,0,#REF!)","v":{"$error":"#REF!"}},{"$f":"IF(#REF!>$Y$3,0,#REF!)","v":{"$error":"#REF!"}},{"$f":"IF(#REF!>$Y$3,0,#REF!)","v":{"$error":"#REF!"}},{"$f":"IF(#REF!>$Y$3,0,#REF!)","v":{"$error":"#REF!"}},{"$f":"IF(#REF!>$Y$3,0,#REF!)","v":{"$error":"#REF!"}},{"$f":"IF(#REF!>$Y$3,0,#REF!)","v":{"$error":"#REF!"}},{"$f":"IF(#REF!>$Y$3,0,#REF!)","v":{"$error":"#REF!"}},{"$f":"IF(#REF!>$Y$3,0,#REF!)","v":{"$error":"#REF!"}},{"$f":"IF(#REF!>$Y$3,0,#REF!)","v":{"$error":"#REF!"}}]
[null,null,48,{"$f":"IF('AS1'!D52=\"\",\"\",'AS1'!D52)","v":""},{"$f":"IF('AS1'!E52=\"\",\"\",'AS1'!E52)","v":""},null,null,null,null,null,null,null,null,null,null,null,null,null,null,null,null,null,null,null,null,null,null,null,null,null,null,null,null,null,null,null,null,null,null,null,null,null,null,null,null,null,null,null,null,null,null,null,null,null,null,null,null,0,{"$f":"IF(PARCIAL1!L$8=0,0,(ROUND(((BF52*10)/PARCIAL2!L$8),1)))","v":0},null,null,0,0,0,0,0,0,0,0,0,0,0,0,0,0,0,0,0,0,0,0,0,0,0,0,0,0,0,0,0,0,0,0,0,0,0,0,0,0,0,0,0,0,0,0,0,0,0,0,0,0,0,0,{"$f":"IF(#REF!>$Y$3,0,#REF!)","v":{"$error":"#REF!"}},{"$f":"IF(#REF!>$Y$3,0,#REF!)","v":{"$error":"#REF!"}},{"$f":"IF(#REF!>$Y$3,0,#REF!)","v":{"$error":"#REF!"}},{"$f":"IF(#REF!>$Y$3,0,#REF!)","v":{"$error":"#REF!"}},{"$f":"IF(#REF!>$Y$3,0,#REF!)","v":{"$error":"#REF!"}},{"$f":"IF(#REF!>$Y$3,0,#REF!)","v":{"$error":"#REF!"}},{"$f":"IF(#REF!>$Y$3,0,#REF!)","v":{"$error":"#REF!"}},{"$f":"IF(#REF!>$Y$3,0,#REF!)","v":{"$error":"#REF!"}},{"$f":"IF(#REF!>$Y$3,0,#REF!)","v":{"$error":"#REF!"}},{"$f":"IF(#REF!>$Y$3,0,#REF!)","v":{"$error":"#REF!"}},{"$f":"IF(#REF!>$Y$3,0,#REF!)","v":{"$error":"#REF!"}},{"$f":"IF(#REF!>$Y$3,0,#REF!)","v":{"$error":"#REF!"}},{"$f":"IF(#REF!>$Y$3,0,#REF!)","v":{"$error":"#REF!"}},{"$f":"IF(#REF!>$Y$3,0,#REF!)","v":{"$error":"#REF!"}},{"$f":"IF(#REF!>$Y$3,0,#REF!)","v":{"$error":"#REF!"}},{"$f":"IF(#REF!>$Y$3,0,#REF!)","v":{"$error":"#REF!"}},{"$f":"IF(#REF!>$Y$3,0,#REF!)","v":{"$error":"#REF!"}},{"$f":"IF(#REF!>$Y$3,0,#REF!)","v":{"$error":"#REF!"}},{"$f":"IF(#REF!>$Y$3,0,#REF!)","v":{"$error":"#REF!"}},{"$f":"IF(#REF!>$Y$3,0,#REF!)","v":{"$error":"#REF!"}},{"$f":"IF(#REF!>$Y$3,0,#REF!)","v":{"$error":"#REF!"}},{"$f":"IF(#REF!>$Y$3,0,#REF!)","v":{"$error":"#REF!"}},{"$f":"IF(#REF!>$Y$3,0,#REF!)","v":{"$error":"#REF!"}},{"$f":"IF(#REF!>$Y$3,0,#REF!)","v":{"$error":"#REF!"}},{"$f":"IF(#REF!>$Y$3,0,#REF!)","v":{"$error":"#REF!"}},{"$f":"IF(#REF!>$Y$3,0,#REF!)","v":{"$error":"#REF!"}},{"$f":"IF(#REF!>$Y$3,0,#REF!)","v":{"$error":"#REF!"}},{"$f":"IF(#REF!>$Y$3,0,#REF!)","v":{"$error":"#REF!"}}]
[null,null,49,{"$f":"IF('AS1'!D53=\"\",\"\",'AS1'!D53)","v":""},{"$f":"IF('AS1'!E53=\"\",\"\",'AS1'!E53)","v":""},null,null,null,null,null,null,null,null,null,null,null,null,null,null,null,null,null,null,null,null,null,null,null,null,null,null,null,null,null,null,null,null,null,null,null,null,null,null,null,null,null,null,null,null,null,null,null,null,null,null,null,null,0,{"$f":"IF(PARCIAL1!L$8=0,0,(ROUND(((BF53*10)/PARCIAL2!L$8),1)))","v":0},null,null,0,0,0,0,0,0,0,0,0,0,0,0,0,0,0,0,0,0,0,0,0,0,0,0,0,0,0,0,0,0,0,0,0,0,0,0,0,0,0,0,0,0,0,0,0,0,0,0,0,0,0,0,{"$f":"IF(#REF!>$Y$3,0,#REF!)","v":{"$error":"#REF!"}},{"$f":"IF(#REF!>$Y$3,0,#REF!)","v":{"$error":"#REF!"}},{"$f":"IF(#REF!>$Y$3,0,#REF!)","v":{"$error":"#REF!"}},{"$f":"IF(#REF!>$Y$3,0,#REF!)","v":{"$error":"#REF!"}},{"$f":"IF(#REF!>$Y$3,0,#REF!)","v":{"$error":"#REF!"}},{"$f":"IF(#REF!>$Y$3,0,#REF!)","v":{"$error":"#REF!"}},{"$f":"IF(#REF!>$Y$3,0,#REF!)","v":{"$error":"#REF!"}},{"$f":"IF(#REF!>$Y$3,0,#REF!)","v":{"$error":"#REF!"}},{"$f":"IF(#REF!>$Y$3,0,#REF!)","v":{"$error":"#REF!"}},{"$f":"IF(#REF!>$Y$3,0,#REF!)","v":{"$error":"#REF!"}},{"$f":"IF(#REF!>$Y$3,0,#REF!)","v":{"$error":"#REF!"}},{"$f":"IF(#REF!>$Y$3,0,#REF!)","v":{"$error":"#REF!"}},{"$f":"IF(#REF!>$Y$3,0,#REF!)","v":{"$error":"#REF!"}},{"$f":"IF(#REF!>$Y$3,0,#REF!)","v":{"$error":"#REF!"}},{"$f":"IF(#REF!>$Y$3,0,#REF!)","v":{"$error":"#REF!"}},{"$f":"IF(#REF!>$Y$3,0,#REF!)","v":{"$error":"#REF!"}},{"$f":"IF(#REF!>$Y$3,0,#REF!)","v":{"$error":"#REF!"}},{"$f":"IF(#REF!>$Y$3,0,#REF!)","v":{"$error":"#REF!"}},{"$f":"IF(#REF!>$Y$3,0,#REF!)","v":{"$error":"#REF!"}},{"$f":"IF(#REF!>$Y$3,0,#REF!)","v":{"$error":"#REF!"}},{"$f":"IF(#REF!>$Y$3,0,#REF!)","v":{"$error":"#REF!"}},{"$f":"IF(#REF!>$Y$3,0,#REF!)","v":{"$error":"#REF!"}},{"$f":"IF(#REF!>$Y$3,0,#REF!)","v":{"$error":"#REF!"}},{"$f":"IF(#REF!>$Y$3,0,#REF!)","v":{"$error":"#REF!"}},{"$f":"IF(#REF!>$Y$3,0,#REF!)","v":{"$error":"#REF!"}},{"$f":"IF(#REF!>$Y$3,0,#REF!)","v":{"$error":"#REF!"}},{"$f":"IF(#REF!>$Y$3,0,#REF!)","v":{"$error":"#REF!"}},{"$f":"IF(#REF!>$Y$3,0,#REF!)","v":{"$error":"#REF!"}}]
[null,null,50,{"$f":"IF('AS1'!D54=\"\",\"\",'AS1'!D54)","v":""},{"$f":"IF('AS1'!E54=\"\",\"\",'AS1'!E54)","v":""},null,null,null,null,null,null,null,null,null,null,null,null,null,null,null,null,null,null,null,null,null,null,null,null,null,null,null,null,null,null,null,null,null,null,null,null,null,null,null,null,null,null,null,null,null,null,null,null,null,null,null,null,0,{"$f":"IF(PARCIAL1!L$8=0,0,(ROUND(((BF54*10)/PARCIAL2!L$8),1)))","v":0},null,null,{"$f":"IF(F54>$Y$3,0,F54)","v":0},0,0,0,0,0,0,0,0,0,0,0,0,0,0,0,0,0,0,0,0,0,0,0,0,0,0,{"$f":"IF(AG54>$Y$3,0,AG54)","v":0},0,0,0,0,0,0,0,0,0,0,0,0,0,0,0,0,0,0,0,0,0,0,0,0,{"$f":"IF(#REF!>$Y$3,0,#REF!)","v":{"$error":"#REF!"}},{"$f":"IF(#REF!>$Y$3,0,#REF!)","v":{"$error":"#REF!"}},{"$f":"IF(#REF!>$Y$3,0,#REF!)","v":{"$error":"#REF!"}},{"$f":"IF(#REF!>$Y$3,0,#REF!)","v":{"$error":"#REF!"}},{"$f":"IF(#REF!>$Y$3,0,#REF!)","v":{"$error":"#REF!"}},{"$f":"IF(#REF!>$Y$3,0,#REF!)","v":{"$error":"#REF!"}},{"$f":"IF(#REF!>$Y$3,0,#REF!)","v":{"$error":"#REF!"}},{"$f":"IF(#REF!>$Y$3,0,#REF!)","v":{"$error":"#REF!"}},{"$f":"IF(#REF!>$Y$3,0,#REF!)","v":{"$error":"#REF!"}},{"$f":"IF(#REF!>$Y$3,0,#REF!)","v":{"$error":"#REF!"}},{"$f":"IF(#REF!>$Y$3,0,#REF!)","v":{"$error":"#REF!"}},{"$f":"IF(#REF!>$Y$3,0,#REF!)","v":{"$error":"#REF!"}},{"$f":"IF(#REF!>$Y$3,0,#REF!)","v":{"$error":"#REF!"}},{"$f":"IF(#REF!>$Y$3,0,#REF!)","v":{"$error":"#REF!"}},{"$f":"IF(#REF!>$Y$3,0,#REF!)","v":{"$error":"#REF!"}},{"$f":"IF(#REF!>$Y$3,0,#REF!)","v":{"$error":"#REF!"}},{"$f":"IF(#REF!>$Y$3,0,#REF!)","v":{"$error":"#REF!"}},{"$f":"IF(#REF!>$Y$3,0,#REF!)","v":{"$error":"#REF!"}},{"$f":"IF(#REF!>$Y$3,0,#REF!)","v":{"$error":"#REF!"}},{"$f":"IF(#REF!>$Y$3,0,#REF!)","v":{"$error":"#REF!"}},{"$f":"IF(#REF!>$Y$3,0,#REF!)","v":{"$error":"#REF!"}},{"$f":"IF(#REF!>$Y$3,0,#REF!)","v":{"$error":"#REF!"}},{"$f":"IF(#REF!>$Y$3,0,#REF!)","v":{"$error":"#REF!"}},{"$f":"IF(#REF!>$Y$3,0,#REF!)","v":{"$error":"#REF!"}},{"$f":"IF(#REF!>$Y$3,0,#REF!)","v":{"$error":"#REF!"}},{"$f":"IF(#REF!>$Y$3,0,#REF!)","v":{"$error":"#REF!"}},{"$f":"IF(#REF!>$Y$3,0,#REF!)","v":{"$error":"#REF!"}},{"$f":"IF(#REF!>$Y$3,0,#REF!)","v":{"$error":"#REF!"}}]
[null,null,51,{"$f":"IF('AS1'!D55=\"\",\"\",'AS1'!D55)","v":""},{"$f":"IF('AS1'!E55=\"\",\"\",'AS1'!E55)","v":""},null,null,null,null,null,null,null,null,null,null,null,null,null,null,null,null,null,null,null,null,null,null,null,null,null,null,null,null,null,null,null,null,null,null,null,null,null,null,null,null,null,null,null,null,null,null,null,null,null,null,null,null,0,{"$f":"IF(PARCIAL1!L$8=0,0,(ROUND(((BF55*10)/PARCIAL2!L$8),1)))","v":0},null,null,0,0,0,0,0,0,0,0,0,0,0,0,0,0,0,0,{"$f":"IF(V55>$Y$3,0,V55)","v":0},0,0,0,0,0,0,0,0,0,0,0,0,0,0,0,0,0,0,0,0,0,0,0,0,0,0,0,0,0,0,0,0,0,0,0,{"$f":"IF(#REF!>$Y$3,0,#REF!)","v":{"$error":"#REF!"}},{"$f":"IF(#REF!>$Y$3,0,#REF!)","v":{"$error":"#REF!"}},{"$f":"IF(#REF!>$Y$3,0,#REF!)","v":{"$error":"#REF!"}},{"$f":"IF(#REF!>$Y$3,0,#REF!)","v":{"$error":"#REF!"}},{"$f":"IF(#REF!>$Y$3,0,#REF!)","v":{"$error":"#REF!"}},{"$f":"IF(#REF!>$Y$3,0,#REF!)","v":{"$error":"#REF!"}},{"$f":"IF(#REF!>$Y$3,0,#REF!)","v":{"$error":"#REF!"}},{"$f":"IF(#REF!>$Y$3,0,#REF!)","v":{"$error":"#REF!"}},{"$f":"IF(#REF!>$Y$3,0,#REF!)","v":{"$error":"#REF!"}},{"$f":"IF(#REF!>$Y$3,0,#REF!)","v":{"$error":"#REF!"}},{"$f":"IF(#REF!>$Y$3,0,#REF!)","v":{"$error":"#REF!"}},{"$f":"IF(#REF!>$Y$3,0,#REF!)","v":{"$error":"#REF!"}},{"$f":"IF(#REF!>$Y$3,0,#REF!)","v":{"$error":"#REF!"}},{"$f":"IF(#REF!>$Y$3,0,#REF!)","v":{"$error":"#REF!"}},{"$f":"IF(#REF!>$Y$3,0,#REF!)","v":{"$error":"#REF!"}},{"$f":"IF(#REF!>$Y$3,0,#REF!)","v":{"$error":"#REF!"}},{"$f":"IF(#REF!>$Y$3,0,#REF!)","v":{"$error":"#REF!"}},{"$f":"IF(#REF!>$Y$3,0,#REF!)","v":{"$error":"#REF!"}},{"$f":"IF(#REF!>$Y$3,0,#REF!)","v":{"$error":"#REF!"}},{"$f":"IF(#REF!>$Y$3,0,#REF!)","v":{"$error":"#REF!"}},{"$f":"IF(#REF!>$Y$3,0,#REF!)","v":{"$error":"#REF!"}},{"$f":"IF(#REF!>$Y$3,0,#REF!)","v":{"$error":"#REF!"}},{"$f":"IF(#REF!>$Y$3,0,#REF!)","v":{"$error":"#REF!"}},{"$f":"IF(#REF!>$Y$3,0,#REF!)","v":{"$error":"#REF!"}},{"$f":"IF(#REF!>$Y$3,0,#REF!)","v":{"$error":"#REF!"}},{"$f":"IF(#REF!>$Y$3,0,#REF!)","v":{"$error":"#REF!"}},{"$f":"IF(#REF!>$Y$3,0,#REF!)","v":{"$error":"#REF!"}},{"$f":"IF(#REF!>$Y$3,0,#REF!)","v":{"$error":"#REF!"}}]
[null,null,52,{"$f":"IF('AS1'!D56=\"\",\"\",'AS1'!D56)","v":""},{"$f":"IF('AS1'!E56=\"\",\"\",'AS1'!E56)","v":""},null,null,null,null,null,null,null,null,null,null,null,null,null,null,null,null,null,null,null,null,null,null,null,null,null,null,null,null,null,null,null,null,null,null,null,null,null,null,null,null,null,null,null,null,null,null,null,null,null,null,null,null,0,{"$f":"IF(PARCIAL1!L$8=0,0,(ROUND(((BF56*10)/PARCIAL2!L$8),1)))","v":0},null,null,0,0,0,0,0,0,0,0,0,0,0,0,0,0,0,0,0,0,0,0,0,0,0,0,0,0,0,0,0,0,0,0,0,0,0,0,0,0,0,0,0,0,0,0,0,0,0,0,0,0,0,0,{"$f":"IF(#REF!>$Y$3,0,#REF!)","v":{"$error":"#REF!"}},{"$f":"IF(#REF!>$Y$3,0,#REF!)","v":{"$error":"#REF!"}},{"$f":"IF(#REF!>$Y$3,0,#REF!)","v":{"$error":"#REF!"}},{"$f":"IF(#REF!>$Y$3,0,#REF!)","v":{"$error":"#REF!"}},{"$f":"IF(#REF!>$Y$3,0,#REF!)","v":{"$error":"#REF!"}},{"$f":"IF(#REF!>$Y$3,0,#REF!)","v":{"$error":"#REF!"}},{"$f":"IF(#REF!>$Y$3,0,#REF!)","v":{"$error":"#REF!"}},{"$f":"IF(#REF!>$Y$3,0,#REF!)","v":{"$error":"#REF!"}},{"$f":"IF(#REF!>$Y$3,0,#REF!)","v":{"$error":"#REF!"}},{"$f":"IF(#REF!>$Y$3,0,#REF!)","v":{"$error":"#REF!"}},{"$f":"IF(#REF!>$Y$3,0,#REF!)","v":{"$error":"#REF!"}},{"$f":"IF(#REF!>$Y$3,0,#REF!)","v":{"$error":"#REF!"}},{"$f":"IF(#REF!>$Y$3,0,#REF!)","v":{"$error":"#REF!"}},{"$f":"IF(#REF!>$Y$3,0,#REF!)","v":{"$error":"#REF!"}},{"$f":"IF(#REF!>$Y$3,0,#REF!)","v":{"$error":"#REF!"}},{"$f":"IF(#REF!>$Y$3,0,#REF!)","v":{"$error":"#REF!"}},{"$f":"IF(#REF!>$Y$3,0,#REF!)","v":{"$error":"#REF!"}},{"$f":"IF(#REF!>$Y$3,0,#REF!)","v":{"$error":"#REF!"}},{"$f":"IF(#REF!>$Y$3,0,#REF!)","v":{"$error":"#REF!"}},{"$f":"IF(#REF!>$Y$3,0,#REF!)","v":{"$error":"#REF!"}},{"$f":"IF(#REF!>$Y$3,0,#REF!)","v":{"$error":"#REF!"}},{"$f":"IF(#REF!>$Y$3,0,#REF!)","v":{"$error":"#REF!"}},{"$f":"IF(#REF!>$Y$3,0,#REF!)","v":{"$error":"#REF!"}},{"$f":"IF(#REF!>$Y$3,0,#REF!)","v":{"$error":"#REF!"}},{"$f":"IF(#REF!>$Y$3,0,#REF!)","v":{"$error":"#REF!"}},{"$f":"IF(#REF!>$Y$3,0,#REF!)","v":{"$error":"#REF!"}},{"$f":"IF(#REF!>$Y$3,0,#REF!)","v":{"$error":"#REF!"}},{"$f":"IF(#REF!>$Y$3,0,#REF!)","v":{"$error":"#REF!"}}]
[null,null,53,{"$f":"IF('AS1'!D57=\"\",\"\",'AS1'!D57)","v":""},{"$f":"IF('AS1'!E57=\"\",\"\",'AS1'!E57)","v":""},null,null,null,null,null,null,null,null,null,null,null,null,null,null,null,null,null,null,null,null,null,null,null,null,null,null,null,null,null,null,null,null,null,null,null,null,null,null,null,null,null,null,null,null,null,null,null,null,null,null,null,null,0,{"$f":"IF(PARCIAL1!L$8=0,0,(ROUND(((BF57*10)/PARCIAL2!L$8),1)))","v":0},null,null,0,0,0,0,0,0,0,0,0,0,0,0,0,0,0,0,0,0,0,0,0,0,0,0,0,0,0,0,0,0,0,0,0,0,0,0,0,0,0,0,0,0,0,0,0,0,0,0,0,0,0,0,{"$f":"IF(#REF!>$Y$3,0,#REF!)","v":{"$error":"#REF!"}},{"$f":"IF(#REF!>$Y$3,0,#REF!)","v":{"$error":"#REF!"}},{"$f":"IF(#REF!>$Y$3,0,#REF!)","v":{"$error":"#REF!"}},{"$f":"IF(#REF!>$Y$3,0,#REF!)","v":{"$error":"#REF!"}},{"$f":"IF(#REF!>$Y$3,0,#REF!)","v":{"$error":"#REF!"}},{"$f":"IF(#REF!>$Y$3,0,#REF!)","v":{"$error":"#REF!"}},{"$f":"IF(#REF!>$Y$3,0,#REF!)","v":{"$error":"#REF!"}},{"$f":"IF(#REF!>$Y$3,0,#REF!)","v":{"$error":"#REF!"}},{"$f":"IF(#REF!>$Y$3,0,#REF!)","v":{"$error":"#REF!"}},{"$f":"IF(#REF!>$Y$3,0,#REF!)","v":{"$error":"#REF!"}},{"$f":"IF(#REF!>$Y$3,0,#REF!)","v":{"$error":"#REF!"}},{"$f":"IF(#REF!>$Y$3,0,#REF!)","v":{"$error":"#REF!"}},{"$f":"IF(#REF!>$Y$3,0,#REF!)","v":{"$error":"#REF!"}},{"$f":"IF(#REF!>$Y$3,0,#REF!)","v":{"$error":"#REF!"}},{"$f":"IF(#REF!>$Y$3,0,#REF!)","v":{"$error":"#REF!"}},{"$f":"IF(#REF!>$Y$3,0,#REF!)","v":{"$error":"#REF!"}},{"$f":"IF(#REF!>$Y$3,0,#REF!)","v":{"$error":"#REF!"}},{"$f":"IF(#REF!>$Y$3,0,#REF!)","v":{"$error":"#REF!"}},{"$f":"IF(#REF!>$Y$3,0,#REF!)","v":{"$error":"#REF!"}},{"$f":"IF(#REF!>$Y$3,0,#REF!)","v":{"$error":"#REF!"}},{"$f":"IF(#REF!>$Y$3,0,#REF!)","v":{"$error":"#REF!"}},{"$f":"IF(#REF!>$Y$3,0,#REF!)","v":{"$error":"#REF!"}},{"$f":"IF(#REF!>$Y$3,0,#REF!)","v":{"$error":"#REF!"}},{"$f":"IF(#REF!>$Y$3,0,#REF!)","v":{"$error":"#REF!"}},{"$f":"IF(#REF!>$Y$3,0,#REF!)","v":{"$error":"#REF!"}},{"$f":"IF(#REF!>$Y$3,0,#REF!)","v":{"$error":"#REF!"}},{"$f":"IF(#REF!>$Y$3,0,#REF!)","v":{"$error":"#REF!"}},{"$f":"IF(#REF!>$Y$3,0,#REF!)","v":{"$error":"#REF!"}}]
[null,null,54,{"$f":"IF('AS1'!D58=\"\",\"\",'AS1'!D58)","v":""},{"$f":"IF('AS1'!E58=\"\",\"\",'AS1'!E58)","v":""},null,null,null,null,null,null,null,null,null,null,null,null,null,null,null,null,null,null,null,null,null,null,null,null,null,null,null,null,null,null,null,null,null,null,null,null,null,null,null,null,null,null,null,null,null,null,null,null,null,null,null,null,0,{"$f":"IF(PARCIAL1!L$8=0,0,(ROUND(((BF58*10)/PARCIAL2!L$8),1)))","v":0},null,null,0,0,0,0,0,0,0,0,0,0,0,0,0,0,0,0,0,0,0,0,0,0,0,0,0,0,0,0,0,0,0,0,0,0,0,{"$f":"IF(AO58>$Y$3,0,AO58)","v":0},0,0,0,0,0,0,0,0,0,0,0,0,0,0,0,0,{"$f":"IF(#REF!>$Y$3,0,#REF!)","v":{"$error":"#REF!"}},{"$f":"IF(#REF!>$Y$3,0,#REF!)","v":{"$error":"#REF!"}},{"$f":"IF(#REF!>$Y$3,0,#REF!)","v":{"$error":"#REF!"}},{"$f":"IF(#REF!>$Y$3,0,#REF!)","v":{"$error":"#REF!"}},{"$f":"IF(#REF!>$Y$3,0,#REF!)","v":{"$error":"#REF!"}},{"$f":"IF(#REF!>$Y$3,0,#REF!)","v":{"$error":"#REF!"}},{"$f":"IF(#REF!>$Y$3,0,#REF!)","v":{"$error":"#REF!"}},{"$f":"IF(#REF!>$Y$3,0,#REF!)","v":{"$error":"#REF!"}},{"$f":"IF(#REF!>$Y$3,0,#REF!)","v":{"$error":"#REF!"}},{"$f":"IF(#REF!>$Y$3,0,#REF!)","v":{"$error":"#REF!"}},{"$f":"IF(#REF!>$Y$3,0,#REF!)","v":{"$error":"#REF!"}},{"$f":"IF(#REF!>$Y$3,0,#REF!)","v":{"$error":"#REF!"}},{"$f":"IF(#REF!>$Y$3,0,#REF!)","v":{"$error":"#REF!"}},{"$f":"IF(#REF!>$Y$3,0,#REF!)","v":{"$error":"#REF!"}},{"$f":"IF(#REF!>$Y$3,0,#REF!)","v":{"$error":"#REF!"}},{"$f":"IF(#REF!>$Y$3,0,#REF!)","v":{"$error":"#REF!"}},{"$f":"IF(#REF!>$Y$3,0,#REF!)","v":{"$error":"#REF!"}},{"$f":"IF(#REF!>$Y$3,0,#REF!)","v":{"$error":"#REF!"}},{"$f":"IF(#REF!>$Y$3,0,#REF!)","v":{"$error":"#REF!"}},{"$f":"IF(#REF!>$Y$3,0,#REF!)","v":{"$error":"#REF!"}},{"$f":"IF(#REF!>$Y$3,0,#REF!)","v":{"$error":"#REF!"}},{"$f":"IF(#REF!>$Y$3,0,#REF!)","v":{"$error":"#REF!"}},{"$f":"IF(#REF!>$Y$3,0,#REF!)","v":{"$error":"#REF!"}},{"$f":"IF(#REF!>$Y$3,0,#REF!)","v":{"$error":"#REF!"}},{"$f":"IF(#REF!>$Y$3,0,#REF!)","v":{"$error":"#REF!"}},{"$f":"IF(#REF!>$Y$3,0,#REF!)","v":{"$error":"#REF!"}},{"$f":"IF(#REF!>$Y$3,0,#REF!)","v":{"$error":"#REF!"}},{"$f":"IF(#REF!>$Y$3,0,#REF!)","v":{"$error":"#REF!"}}]
[null,null,55,{"$f":"IF('AS1'!D59=\"\",\"\",'AS1'!D59)","v":""},{"$f":"IF('AS1'!E59=\"\",\"\",'AS1'!E59)","v":""},null,null,null,null,null,null,null,null,null,null,null,null,null,null,null,null,null,null,null,null,null,null,null,null,null,null,null,null,null,null,null,null,null,null,null,null,null,null,null,null,null,null,null,null,null,null,null,null,null,null,null,null,0,{"$f":"IF(PARCIAL1!L$8=0,0,(ROUND(((BF59*10)/PARCIAL2!L$8),1)))","v":0},null,null,0,0,0,0,0,0,0,0,0,0,0,0,0,0,0,0,0,0,0,0,0,0,0,0,0,0,0,0,0,0,0,0,0,0,0,0,0,0,0,0,0,0,0,0,0,0,0,0,0,0,0,0,{"$f":"IF(#REF!>$Y$3,0,#REF!)","v":{"$error":"#REF!"}},{"$f":"IF(#REF!>$Y$3,0,#REF!)","v":{"$error":"#REF!"}},{"$f":"IF(#REF!>$Y$3,0,#REF!)","v":{"$error":"#REF!"}},{"$f":"IF(#REF!>$Y$3,0,#REF!)","v":{"$error":"#REF!"}},{"$f":"IF(#REF!>$Y$3,0,#REF!)","v":{"$error":"#REF!"}},{"$f":"IF(#REF!>$Y$3,0,#REF!)","v":{"$error":"#REF!"}},{"$f":"IF(#REF!>$Y$3,0,#REF!)","v":{"$error":"#REF!"}},{"$f":"IF(#REF!>$Y$3,0,#REF!)","v":{"$error":"#REF!"}},{"$f":"IF(#REF!>$Y$3,0,#REF!)","v":{"$error":"#REF!"}},{"$f":"IF(#REF!>$Y$3,0,#REF!)","v":{"$error":"#REF!"}},{"$f":"IF(#REF!>$Y$3,0,#REF!)","v":{"$error":"#REF!"}},{"$f":"IF(#REF!>$Y$3,0,#REF!)","v":{"$error":"#REF!"}},{"$f":"IF(#REF!>$Y$3,0,#REF!)","v":{"$error":"#REF!"}},{"$f":"IF(#REF!>$Y$3,0,#REF!)","v":{"$error":"#REF!"}},{"$f":"IF(#REF!>$Y$3,0,#REF!)","v":{"$error":"#REF!"}},{"$f":"IF(#REF!>$Y$3,0,#REF!)","v":{"$error":"#REF!"}},{"$f":"IF(#REF!>$Y$3,0,#REF!)","v":{"$error":"#REF!"}},{"$f":"IF(#REF!>$Y$3,0,#REF!)","v":{"$error":"#REF!"}},{"$f":"IF(#REF!>$Y$3,0,#REF!)","v":{"$error":"#REF!"}},{"$f":"IF(#REF!>$Y$3,0,#REF!)","v":{"$error":"#REF!"}},{"$f":"IF(#REF!>$Y$3,0,#REF!)","v":{"$error":"#REF!"}},{"$f":"IF(#REF!>$Y$3,0,#REF!)","v":{"$error":"#REF!"}},{"$f":"IF(#REF!>$Y$3,0,#REF!)","v":{"$error":"#REF!"}},{"$f":"IF(#REF!>$Y$3,0,#REF!)","v":{"$error":"#REF!"}},{"$f":"IF(#REF!>$Y$3,0,#REF!)","v":{"$error":"#REF!"}},{"$f":"IF(#REF!>$Y$3,0,#REF!)","v":{"$error":"#REF!"}},{"$f":"IF(#REF!>$Y$3,0,#REF!)","v":{"$error":"#REF!"}},{"$f":"IF(#REF!>$Y$3,0,#REF!)","v":{"$error":"#REF!"}}]
[null,null,56,{"$f":"IF('AS1'!D60=\"\",\"\",'AS1'!D60)","v":""},{"$f":"IF('AS1'!E60=\"\",\"\",'AS1'!E60)","v":""},null,null,null,null,null,null,null,null,null,null,null,null,null,null,null,null,null,null,null,null,null,null,null,null,null,null,null,null,null,null,null,null,null,null,null,null,null,null,null,null,null,null,null,null,null,null,null,null,null,null,null,null,0,{"$f":"IF(PARCIAL1!L$8=0,0,(ROUND(((BF60*10)/PARCIAL2!L$8),1)))","v":0},null,null,0,0,0,0,0,0,0,0,0,0,0,0,0,0,0,0,0,0,0,0,0,0,0,0,0,0,0,0,0,0,0,0,0,0,0,0,0,0,0,0,0,0,0,0,0,0,0,0,0,0,0,0,{"$f":"IF(#REF!>$Y$3,0,#REF!)","v":{"$error":"#REF!"}},{"$f":"IF(#REF!>$Y$3,0,#REF!)","v":{"$error":"#REF!"}},{"$f":"IF(#REF!>$Y$3,0,#REF!)","v":{"$error":"#REF!"}},{"$f":"IF(#REF!>$Y$3,0,#REF!)","v":{"$error":"#REF!"}},{"$f":"IF(#REF!>$Y$3,0,#REF!)","v":{"$error":"#REF!"}},{"$f":"IF(#REF!>$Y$3,0,#REF!)","v":{"$error":"#REF!"}},{"$f":"IF(#REF!>$Y$3,0,#REF!)","v":{"$error":"#REF!"}},{"$f":"IF(#REF!>$Y$3,0,#REF!)","v":{"$error":"#REF!"}},{"$f":"IF(#REF!>$Y$3,0,#REF!)","v":{"$error":"#REF!"}},{"$f":"IF(#REF!>$Y$3,0,#REF!)","v":{"$error":"#REF!"}},{"$f":"IF(#REF!>$Y$3,0,#REF!)","v":{"$error":"#REF!"}},{"$f":"IF(#REF!>$Y$3,0,#REF!)","v":{"$error":"#REF!"}},{"$f":"IF(#REF!>$Y$3,0,#REF!)","v":{"$error":"#REF!"}},{"$f":"IF(#REF!>$Y$3,0,#REF!)","v":{"$error":"#REF!"}},{"$f":"IF(#REF!>$Y$3,0,#REF!)","v":{"$error":"#REF!"}},{"$f":"IF(#REF!>$Y$3,0,#REF!)","v":{"$error":"#REF!"}},{"$f":"IF(#REF!>$Y$3,0,#REF!)","v":{"$error":"#REF!"}},{"$f":"IF(#REF!>$Y$3,0,#REF!)","v":{"$error":"#REF!"}},{"$f":"IF(#REF!>$Y$3,0,#REF!)","v":{"$error":"#REF!"}},{"$f":"IF(#REF!>$Y$3,0,#REF!)","v":{"$error":"#REF!"}},{"$f":"IF(#REF!>$Y$3,0,#REF!)","v":{"$error":"#REF!"}},{"$f":"IF(#REF!>$Y$3,0,#REF!)","v":{"$error":"#REF!"}},{"$f":"IF(#REF!>$Y$3,0,#REF!)","v":{"$error":"#REF!"}},{"$f":"IF(#REF!>$Y$3,0,#REF!)","v":{"$error":"#REF!"}},{"$f":"IF(#REF!>$Y$3,0,#REF!)","v":{"$error":"#REF!"}},{"$f":"IF(#REF!>$Y$3,0,#REF!)","v":{"$error":"#REF!"}},{"$f":"IF(#REF!>$Y$3,0,#REF!)","v":{"$error":"#REF!"}},{"$f":"IF(#REF!>$Y$3,0,#REF!)","v":{"$error":"#REF!"}}]
[null,null,57,{"$f":"IF('AS1'!D61=\"\",\"\",'AS1'!D61)","v":""},{"$f":"IF('AS1'!E61=\"\",\"\",'AS1'!E61)","v":""},null,null,null,null,null,null,null,null,null,null,null,null,null,null,null,null,null,null,null,null,null,null,null,null,null,null,null,null,null,null,null,null,null,null,null,null,null,null,null,null,null,null,null,null,null,null,null,null,null,null,null,null,0,{"$f":"IF(PARCIAL1!L$8=0,0,(ROUND(((BF61*10)/PARCIAL2!L$8),1)))","v":0},null,null,0,0,0,0,0,0,0,0,0,0,0,0,0,0,0,0,0,0,0,0,0,0,0,0,0,0,0,0,0,0,0,0,0,0,0,0,0,0,0,0,0,0,0,0,0,0,0,0,0,0,0,0,{"$f":"IF(#REF!>$Y$3,0,#REF!)","v":{"$error":"#REF!"}},{"$f":"IF(#REF!>$Y$3,0,#REF!)","v":{"$error":"#REF!"}},{"$f":"IF(#REF!>$Y$3,0,#REF!)","v":{"$error":"#REF!"}},{"$f":"IF(#REF!>$Y$3,0,#REF!)","v":{"$error":"#REF!"}},{"$f":"IF(#REF!>$Y$3,0,#REF!)","v":{"$error":"#REF!"}},{"$f":"IF(#REF!>$Y$3,0,#REF!)","v":{"$error":"#REF!"}},{"$f":"IF(#REF!>$Y$3,0,#REF!)","v":{"$error":"#REF!"}},{"$f":"IF(#REF!>$Y$3,0,#REF!)","v":{"$error":"#REF!"}},{"$f":"IF(#REF!>$Y$3,0,#REF!)","v":{"$error":"#REF!"}},{"$f":"IF(#REF!>$Y$3,0,#REF!)","v":{"$error":"#REF!"}},{"$f":"IF(#REF!>$Y$3,0,#REF!)","v":{"$error":"#REF!"}},{"$f":"IF(#REF!>$Y$3,0,#REF!)","v":{"$error":"#REF!"}},{"$f":"IF(#REF!>$Y$3,0,#REF!)","v":{"$error":"#REF!"}},{"$f":"IF(#REF!>$Y$3,0,#REF!)","v":{"$error":"#REF!"}},{"$f":"IF(#REF!>$Y$3,0,#REF!)","v":{"$error":"#REF!"}},{"$f":"IF(#REF!>$Y$3,0,#REF!)","v":{"$error":"#REF!"}},{"$f":"IF(#REF!>$Y$3,0,#REF!)","v":{"$error":"#REF!"}},{"$f":"IF(#REF!>$Y$3,0,#REF!)","v":{"$error":"#REF!"}},{"$f":"IF(#REF!>$Y$3,0,#REF!)","v":{"$error":"#REF!"}},{"$f":"IF(#REF!>$Y$3,0,#REF!)","v":{"$error":"#REF!"}},{"$f":"IF(#REF!>$Y$3,0,#REF!)","v":{"$error":"#REF!"}},{"$f":"IF(#REF!>$Y$3,0,#REF!)","v":{"$error":"#REF!"}},{"$f":"IF(#REF!>$Y$3,0,#REF!)","v":{"$error":"#REF!"}},{"$f":"IF(#REF!>$Y$3,0,#REF!)","v":{"$error":"#REF!"}},{"$f":"IF(#REF!>$Y$3,0,#REF!)","v":{"$error":"#REF!"}},{"$f":"IF(#REF!>$Y$3,0,#REF!)","v":{"$error":"#REF!"}},{"$f":"IF(#REF!>$Y$3,0,#REF!)","v":{"$error":"#REF!"}},{"$f":"IF(#REF!>$Y$3,0,#REF!)","v":{"$error":"#REF!"}}]
[null,null,58,{"$f":"IF('AS1'!D62=\"\",\"\",'AS1'!D62)","v":""},{"$f":"IF('AS1'!E62=\"\",\"\",'AS1'!E62)","v":""},null,null,null,null,null,null,null,null,null,null,null,null,null,null,null,null,null,null,null,null,null,null,null,null,null,null,null,null,null,null,null,null,null,null,null,null,null,null,null,null,null,null,null,null,null,null,null,null,null,null,null,null,0,{"$f":"IF(PARCIAL1!L$8=0,0,(ROUND(((BF62*10)/PARCIAL2!L$8),1)))","v":0},null,null,0,0,0,0,0,0,0,0,0,0,0,0,0,0,0,0,0,0,0,0,0,0,0,0,0,0,0,0,0,0,0,0,0,0,0,0,0,0,0,0,0,0,0,0,0,0,0,0,0,0,0,0,{"$f":"IF(#REF!>$Y$3,0,#REF!)","v":{"$error":"#REF!"}},{"$f":"IF(#REF!>$Y$3,0,#REF!)","v":{"$error":"#REF!"}},{"$f":"IF(#REF!>$Y$3,0,#REF!)","v":{"$error":"#REF!"}},{"$f":"IF(#REF!>$Y$3,0,#REF!)","v":{"$error":"#REF!"}},{"$f":"IF(#REF!>$Y$3,0,#REF!)","v":{"$error":"#REF!"}},{"$f":"IF(#REF!>$Y$3,0,#REF!)","v":{"$error":"#REF!"}},{"$f":"IF(#REF!>$Y$3,0,#REF!)","v":{"$error":"#REF!"}},{"$f":"IF(#REF!>$Y$3,0,#REF!)","v":{"$error":"#REF!"}},{"$f":"IF(#REF!>$Y$3,0,#REF!)","v":{"$error":"#REF!"}},{"$f":"IF(#REF!>$Y$3,0,#REF!)","v":{"$error":"#REF!"}},{"$f":"IF(#REF!>$Y$3,0,#REF!)","v":{"$error":"#REF!"}},{"$f":"IF(#REF!>$Y$3,0,#REF!)","v":{"$error":"#REF!"}},{"$f":"IF(#REF!>$Y$3,0,#REF!)","v":{"$error":"#REF!"}},{"$f":"IF(#REF!>$Y$3,0,#REF!)","v":{"$error":"#REF!"}},{"$f":"IF(#REF!>$Y$3,0,#REF!)","v":{"$error":"#REF!"}},{"$f":"IF(#REF!>$Y$3,0,#REF!)","v":{"$error":"#REF!"}},{"$f":"IF(#REF!>$Y$3,0,#REF!)","v":{"$error":"#REF!"}},{"$f":"IF(#REF!>$Y$3,0,#REF!)","v":{"$error":"#REF!"}},{"$f":"IF(#REF!>$Y$3,0,#REF!)","v":{"$error":"#REF!"}},{"$f":"IF(#REF!>$Y$3,0,#REF!)","v":{"$error":"#REF!"}},{"$f":"IF(#REF!>$Y$3,0,#REF!)","v":{"$error":"#REF!"}},{"$f":"IF(#REF!>$Y$3,0,#REF!)","v":{"$error":"#REF!"}},{"$f":"IF(#REF!>$Y$3,0,#REF!)","v":{"$error":"#REF!"}},{"$f":"IF(#REF!>$Y$3,0,#REF!)","v":{"$error":"#REF!"}},{"$f":"IF(#REF!>$Y$3,0,#REF!)","v":{"$error":"#REF!"}},{"$f":"IF(#REF!>$Y$3,0,#REF!)","v":{"$error":"#REF!"}},{"$f":"IF(#REF!>$Y$3,0,#REF!)","v":{"$error":"#REF!"}},{"$f":"IF(#REF!>$Y$3,0,#REF!)","v":{"$error":"#REF!"}}]
[null,null,59,{"$f":"IF('AS1'!D63=\"\",\"\",'AS1'!D63)","v":""},{"$f":"IF('AS1'!E63=\"\",\"\",'AS1'!E63)","v":""},null,null,null,null,null,null,null,null,null,null,null,null,null,null,null,null,null,null,null,null,null,null,null,null,null,null,null,null,null,null,null,null,null,null,null,null,null,null,null,null,null,null,null,null,null,null,null,null,null,null,null,null,0,{"$f":"IF(PARCIAL1!L$8=0,0,(ROUND(((BF63*10)/PARCIAL2!L$8),1)))","v":0},null,null,0,0,0,0,0,0,0,0,0,0,0,0,0,0,0,0,0,0,0,0,0,0,0,0,0,0,0,0,0,0,0,0,0,0,0,0,0,0,0,0,0,0,0,0,0,0,0,0,0,0,0,0,{"$f":"IF(#REF!>$Y$3,0,#REF!)","v":{"$error":"#REF!"}},{"$f":"IF(#REF!>$Y$3,0,#REF!)","v":{"$error":"#REF!"}},{"$f":"IF(#REF!>$Y$3,0,#REF!)","v":{"$error":"#REF!"}},{"$f":"IF(#REF!>$Y$3,0,#REF!)","v":{"$error":"#REF!"}},{"$f":"IF(#REF!>$Y$3,0,#REF!)","v":{"$error":"#REF!"}},{"$f":"IF(#REF!>$Y$3,0,#REF!)","v":{"$error":"#REF!"}},{"$f":"IF(#REF!>$Y$3,0,#REF!)","v":{"$error":"#REF!"}},{"$f":"IF(#REF!>$Y$3,0,#REF!)","v":{"$error":"#REF!"}},{"$f":"IF(#REF!>$Y$3,0,#REF!)","v":{"$error":"#REF!"}},{"$f":"IF(#REF!>$Y$3,0,#REF!)","v":{"$error":"#REF!"}},{"$f":"IF(#REF!>$Y$3,0,#REF!)","v":{"$error":"#REF!"}},{"$f":"IF(#REF!>$Y$3,0,#REF!)","v":{"$error":"#REF!"}},{"$f":"IF(#REF!>$Y$3,0,#REF!)","v":{"$error":"#REF!"}},{"$f":"IF(#REF!>$Y$3,0,#REF!)","v":{"$error":"#REF!"}},{"$f":"IF(#REF!>$Y$3,0,#REF!)","v":{"$error":"#REF!"}},{"$f":"IF(#REF!>$Y$3,0,#REF!)","v":{"$error":"#REF!"}},{"$f":"IF(#REF!>$Y$3,0,#REF!)","v":{"$error":"#REF!"}},{"$f":"IF(#REF!>$Y$3,0,#REF!)","v":{"$error":"#REF!"}},{"$f":"IF(#REF!>$Y$3,0,#REF!)","v":{"$error":"#REF!"}},{"$f":"IF(#REF!>$Y$3,0,#REF!)","v":{"$error":"#REF!"}},{"$f":"IF(#REF!>$Y$3,0,#REF!)","v":{"$error":"#REF!"}},{"$f":"IF(#REF!>$Y$3,0,#REF!)","v":{"$error":"#REF!"}},{"$f":"IF(#REF!>$Y$3,0,#REF!)","v":{"$error":"#REF!"}},{"$f":"IF(#REF!>$Y$3,0,#REF!)","v":{"$error":"#REF!"}},{"$f":"IF(#REF!>$Y$3,0,#REF!)","v":{"$error":"#REF!"}},{"$f":"IF(#REF!>$Y$3,0,#REF!)","v":{"$error":"#REF!"}},{"$f":"IF(#REF!>$Y$3,0,#REF!)","v":{"$error":"#REF!"}},{"$f":"IF(#REF!>$Y$3,0,#REF!)","v":{"$error":"#REF!"}}]
[null,null,60,{"$f":"IF('AS1'!D64=\"\",\"\",'AS1'!D64)","v":""},{"$f":"IF('AS1'!E64=\"\",\"\",'AS1'!E64)","v":""},null,null,null,null,null,null,null,null,null,null,null,null,null,null,null,null,null,null,null,null,null,null,null,null,null,null,null,null,null,null,null,null,null,null,null,null,null,null,null,null,null,null,null,null,null,null,null,null,null,null,null,null,0,{"$f":"IF(PARCIAL1!L$8=0,0,(ROUND(((BF64*10)/PARCIAL2!L$8),1)))","v":0},null,null,0,0,0,0,0,0,0,0,0,0,0,0,0,0,0,0,0,0,0,0,0,0,0,0,0,0,0,0,0,0,0,0,0,0,0,0,0,0,0,0,0,0,0,0,0,0,0,0,0,0,0,0,{"$f":"IF(#REF!>$Y$3,0,#REF!)","v":{"$error":"#REF!"}},{"$f":"IF(#REF!>$Y$3,0,#REF!)","v":{"$error":"#REF!"}},{"$f":"IF(#REF!>$Y$3,0,#REF!)","v":{"$error":"#REF!"}},{"$f":"IF(#REF!>$Y$3,0,#REF!)","v":{"$error":"#REF!"}},{"$f":"IF(#REF!>$Y$3,0,#REF!)","v":{"$error":"#REF!"}},{"$f":"IF(#REF!>$Y$3,0,#REF!)","v":{"$error":"#REF!"}},{"$f":"IF(#REF!>$Y$3,0,#REF!)","v":{"$error":"#REF!"}},{"$f":"IF(#REF!>$Y$3,0,#REF!)","v":{"$error":"#REF!"}},{"$f":"IF(#REF!>$Y$3,0,#REF!)","v":{"$error":"#REF!"}},{"$f":"IF(#REF!>$Y$3,0,#REF!)","v":{"$error":"#REF!"}},{"$f":"IF(#REF!>$Y$3,0,#REF!)","v":{"$error":"#REF!"}},{"$f":"IF(#REF!>$Y$3,0,#REF!)","v":{"$error":"#REF!"}},{"$f":"IF(#REF!>$Y$3,0,#REF!)","v":{"$error":"#REF!"}},{"$f":"IF(#REF!>$Y$3,0,#REF!)","v":{"$error":"#REF!"}},{"$f":"IF(#REF!>$Y$3,0,#REF!)","v":{"$error":"#REF!"}},{"$f":"IF(#REF!>$Y$3,0,#REF!)","v":{"$error":"#REF!"}},{"$f":"IF(#REF!>$Y$3,0,#REF!)","v":{"$error":"#REF!"}},{"$f":"IF(#REF!>$Y$3,0,#REF!)","v":{"$error":"#REF!"}},{"$f":"IF(#REF!>$Y$3,0,#REF!)","v":{"$error":"#REF!"}},{"$f":"IF(#REF!>$Y$3,0,#REF!)","v":{"$error":"#REF!"}},{"$f":"IF(#REF!>$Y$3,0,#REF!)","v":{"$error":"#REF!"}},{"$f":"IF(#REF!>$Y$3,0,#REF!)","v":{"$error":"#REF!"}},{"$f":"IF(#REF!>$Y$3,0,#REF!)","v":{"$error":"#REF!"}},{"$f":"IF(#REF!>$Y$3,0,#REF!)","v":{"$error":"#REF!"}},{"$f":"IF(#REF!>$Y$3,0,#REF!)","v":{"$error":"#REF!"}},{"$f":"IF(#REF!>$Y$3,0,#REF!)","v":{"$error":"#REF!"}},{"$f":"IF(#REF!>$Y$3,0,#REF!)","v":{"$error":"#REF!"}},{"$f":"IF(#REF!>$Y$3,0,#REF!)","v":{"$error":"#REF!"}}]
[null,null,61,{"$f":"IF('AS1'!D65=\"\",\"\",'AS1'!D65)","v":""},{"$f":"IF('AS1'!E65=\"\",\"\",'AS1'!E65)","v":""},null,null,null,null,null,null,null,null,null,null,null,null,null,null,null,null,null,null,null,null,null,null,null,null,null,null,null,null,null,null,null,null,null,null,null,null,null,null,null,null,null,null,null,null,null,null,null,null,null,null,null,null,0,{"$f":"IF(PARCIAL1!L$8=0,0,(ROUND(((BF65*10)/PARCIAL2!L$8),1)))","v":0},null,null,0,0,0,0,0,0,0,0,0,0,0,0,0,0,0,0,0,0,0,0,0,0,0,0,0,0,0,0,0,0,0,0,0,0,0,0,0,0,0,0,0,0,0,0,0,0,0,0,0,0,0,0,{"$f":"IF(#REF!>$Y$3,0,#REF!)","v":{"$error":"#REF!"}},{"$f":"IF(#REF!>$Y$3,0,#REF!)","v":{"$error":"#REF!"}},{"$f":"IF(#REF!>$Y$3,0,#REF!)","v":{"$error":"#REF!"}},{"$f":"IF(#REF!>$Y$3,0,#REF!)","v":{"$error":"#REF!"}},{"$f":"IF(#REF!>$Y$3,0,#REF!)","v":{"$error":"#REF!"}},{"$f":"IF(#REF!>$Y$3,0,#REF!)","v":{"$error":"#REF!"}},{"$f":"IF(#REF!>$Y$3,0,#REF!)","v":{"$error":"#REF!"}},{"$f":"IF(#REF!>$Y$3,0,#REF!)","v":{"$error":"#REF!"}},{"$f":"IF(#REF!>$Y$3,0,#REF!)","v":{"$error":"#REF!"}},{"$f":"IF(#REF!>$Y$3,0,#REF!)","v":{"$error":"#REF!"}},{"$f":"IF(#REF!>$Y$3,0,#REF!)","v":{"$error":"#REF!"}},{"$f":"IF(#REF!>$Y$3,0,#REF!)","v":{"$error":"#REF!"}},{"$f":"IF(#REF!>$Y$3,0,#REF!)","v":{"$error":"#REF!"}},{"$f":"IF(#REF!>$Y$3,0,#REF!)","v":{"$error":"#REF!"}},{"$f":"IF(#REF!>$Y$3,0,#REF!)","v":{"$error":"#REF!"}},{"$f":"IF(#REF!>$Y$3,0,#REF!)","v":{"$error":"#REF!"}},{"$f":"IF(#REF!>$Y$3,0,#REF!)","v":{"$error":"#REF!"}},{"$f":"IF(#REF!>$Y$3,0,#REF!)","v":{"$error":"#REF!"}},{"$f":"IF(#REF!>$Y$3,0,#REF!)","v":{"$error":"#REF!"}},{"$f":"IF(#REF!>$Y$3,0,#REF!)","v":{"$error":"#REF!"}},{"$f":"IF(#REF!>$Y$3,0,#REF!)","v":{"$error":"#REF!"}},{"$f":"IF(#REF!>$Y$3,0,#REF!)","v":{"$error":"#REF!"}},{"$f":"IF(#REF!>$Y$3,0,#REF!)","v":{"$error":"#REF!"}},{"$f":"IF(#REF!>$Y$3,0,#REF!)","v":{"$error":"#REF!"}},{"$f":"IF(#REF!>$Y$3,0,#REF!)","v":{"$error":"#REF!"}},{"$f":"IF(#REF!>$Y$3,0,#REF!)","v":{"$error":"#REF!"}},{"$f":"IF(#REF!>$Y$3,0,#REF!)","v":{"$error":"#REF!"}},{"$f":"IF(#REF!>$Y$3,0,#REF!)","v":{"$error":"#REF!"}}]
[null,null,62,{"$f":"IF('AS1'!D66=\"\",\"\",'AS1'!D66)","v":""},{"$f":"IF('AS1'!E66=\"\",\"\",'AS1'!E66)","v":""},null,null,null,null,null,null,null,null,null,null,null,null,null,null,null,null,null,null,null,null,null,null,null,null,null,null,null,null,null,null,null,null,null,null,null,null,null,null,null,null,null,null,null,null,null,null,null,null,null,null,null,null,0,{"$f":"IF(PARCIAL1!L$8=0,0,(ROUND(((BF66*10)/PARCIAL2!L$8),1)))","v":0},null,null,0,0,0,0,0,0,0,0,0,0,0,0,0,0,0,0,0,0,0,0,0,0,0,0,0,0,0,0,0,0,0,0,0,0,0,0,0,0,0,0,0,0,0,0,0,0,0,0,0,0,0,0,{"$f":"IF(#REF!>$Y$3,0,#REF!)","v":{"$error":"#REF!"}},{"$f":"IF(#REF!>$Y$3,0,#REF!)","v":{"$error":"#REF!"}},{"$f":"IF(#REF!>$Y$3,0,#REF!)","v":{"$error":"#REF!"}},{"$f":"IF(#REF!>$Y$3,0,#REF!)","v":{"$error":"#REF!"}},{"$f":"IF(#REF!>$Y$3,0,#REF!)","v":{"$error":"#REF!"}},{"$f":"IF(#REF!>$Y$3,0,#REF!)","v":{"$error":"#REF!"}},{"$f":"IF(#REF!>$Y$3,0,#REF!)","v":{"$error":"#REF!"}},{"$f":"IF(#REF!>$Y$3,0,#REF!)","v":{"$error":"#REF!"}},{"$f":"IF(#REF!>$Y$3,0,#REF!)","v":{"$error":"#REF!"}},{"$f":"IF(#REF!>$Y$3,0,#REF!)","v":{"$error":"#REF!"}},{"$f":"IF(#REF!>$Y$3,0,#REF!)","v":{"$error":"#REF!"}},{"$f":"IF(#REF!>$Y$3,0,#REF!)","v":{"$error":"#REF!"}},{"$f":"IF(#REF!>$Y$3,0,#REF!)","v":{"$error":"#REF!"}},{"$f":"IF(#REF!>$Y$3,0,#REF!)","v":{"$error":"#REF!"}},{"$f":"IF(#REF!>$Y$3,0,#REF!)","v":{"$error":"#REF!"}},{"$f":"IF(#REF!>$Y$3,0,#REF!)","v":{"$error":"#REF!"}},{"$f":"IF(#REF!>$Y$3,0,#REF!)","v":{"$error":"#REF!"}},{"$f":"IF(#REF!>$Y$3,0,#REF!)","v":{"$error":"#REF!"}},{"$f":"IF(#REF!>$Y$3,0,#REF!)","v":{"$error":"#REF!"}},{"$f":"IF(#REF!>$Y$3,0,#REF!)","v":{"$error":"#REF!"}},{"$f":"IF(#REF!>$Y$3,0,#REF!)","v":{"$error":"#REF!"}},{"$f":"IF(#REF!>$Y$3,0,#REF!)","v":{"$error":"#REF!"}},{"$f":"IF(#REF!>$Y$3,0,#REF!)","v":{"$error":"#REF!"}},{"$f":"IF(#REF!>$Y$3,0,#REF!)","v":{"$error":"#REF!"}},{"$f":"IF(#REF!>$Y$3,0,#REF!)","v":{"$error":"#REF!"}},{"$f":"IF(#REF!>$Y$3,0,#REF!)","v":{"$error":"#REF!"}},{"$f":"IF(#REF!>$Y$3,0,#REF!)","v":{"$error":"#REF!"}},{"$f":"IF(#REF!>$Y$3,0,#REF!)","v":{"$error":"#REF!"}}]
[null,null,63,{"$f":"IF('AS1'!D67=\"\",\"\",'AS1'!D67)","v":""},{"$f":"IF('AS1'!E67=\"\",\"\",'AS1'!E67)","v":""},null,null,null,null,null,null,null,null,null,null,null,null,null,null,null,null,null,null,null,null,null,null,null,null,null,null,null,null,null,null,null,null,null,null,null,null,null,null,null,null,null,null,null,null,null,null,null,null,null,null,null,null,0,{"$f":"IF(PARCIAL1!L$8=0,0,(ROUND(((BF67*10)/PARCIAL2!L$8),1)))","v":0},null,null,0,0,0,0,0,0,0,0,0,0,0,0,0,0,0,0,0,0,0,0,0,0,0,0,0,0,0,0,0,0,0,0,0,0,0,0,0,0,0,0,0,0,0,0,0,0,0,0,0,0,0,0,{"$f":"IF(#REF!>$Y$3,0,#REF!)","v":{"$error":"#REF!"}},{"$f":"IF(#REF!>$Y$3,0,#REF!)","v":{"$error":"#REF!"}},{"$f":"IF(#REF!>$Y$3,0,#REF!)","v":{"$error":"#REF!"}},{"$f":"IF(#REF!>$Y$3,0,#REF!)","v":{"$error":"#REF!"}},{"$f":"IF(#REF!>$Y$3,0,#REF!)","v":{"$error":"#REF!"}},{"$f":"IF(#REF!>$Y$3,0,#REF!)","v":{"$error":"#REF!"}},{"$f":"IF(#REF!>$Y$3,0,#REF!)","v":{"$error":"#REF!"}},{"$f":"IF(#REF!>$Y$3,0,#REF!)","v":{"$error":"#REF!"}},{"$f":"IF(#REF!>$Y$3,0,#REF!)","v":{"$error":"#REF!"}},{"$f":"IF(#REF!>$Y$3,0,#REF!)","v":{"$error":"#REF!"}},{"$f":"IF(#REF!>$Y$3,0,#REF!)","v":{"$error":"#REF!"}},{"$f":"IF(#REF!>$Y$3,0,#REF!)","v":{"$error":"#REF!"}},{"$f":"IF(#REF!>$Y$3,0,#REF!)","v":{"$error":"#REF!"}},{"$f":"IF(#REF!>$Y$3,0,#REF!)","v":{"$error":"#REF!"}},{"$f":"IF(#REF!>$Y$3,0,#REF!)","v":{"$error":"#REF!"}},{"$f":"IF(#REF!>$Y$3,0,#REF!)","v":{"$error":"#REF!"}},{"$f":"IF(#REF!>$Y$3,0,#REF!)","v":{"$error":"#REF!"}},{"$f":"IF(#REF!>$Y$3,0,#REF!)","v":{"$error":"#REF!"}},{"$f":"IF(#REF!>$Y$3,0,#REF!)","v":{"$error":"#REF!"}},{"$f":"IF(#REF!>$Y$3,0,#REF!)","v":{"$error":"#REF!"}},{"$f":"IF(#REF!>$Y$3,0,#REF!)","v":{"$error":"#REF!"}},{"$f":"IF(#REF!>$Y$3,0,#REF!)","v":{"$error":"#REF!"}},{"$f":"IF(#REF!>$Y$3,0,#REF!)","v":{"$error":"#REF!"}},{"$f":"IF(#REF!>$Y$3,0,#REF!)","v":{"$error":"#REF!"}},{"$f":"IF(#REF!>$Y$3,0,#REF!)","v":{"$error":"#REF!"}},{"$f":"IF(#REF!>$Y$3,0,#REF!)","v":{"$error":"#REF!"}},{"$f":"IF(#REF!>$Y$3,0,#REF!)","v":{"$error":"#REF!"}},{"$f":"IF(#REF!>$Y$3,0,#REF!)","v":{"$error":"#REF!"}}]
[null,null,64,{"$f":"IF('AS1'!D68=\"\",\"\",'AS1'!D68)","v":""},{"$f":"IF('AS1'!E68=\"\",\"\",'AS1'!E68)","v":""},null,null,null,null,null,null,null,null,null,null,null,null,null,null,null,null,null,null,null,null,null,null,null,null,null,null,null,null,null,null,null,null,null,null,null,null,null,null,null,null,null,null,null,null,null,null,null,null,null,null,null,null,0,{"$f":"IF(PARCIAL1!L$8=0,0,(ROUND(((BF68*10)/PARCIAL2!L$8),1)))","v":0},null,null,0,0,0,0,0,0,0,0,0,0,0,0,0,0,0,0,0,0,0,0,0,0,0,0,0,0,0,0,0,0,0,0,0,0,0,0,0,0,0,0,0,0,0,0,0,0,0,0,0,0,0,{"$f":"IF(BE68>$Y$3,0,BE68)","v":0},{"$f":"IF(#REF!>$Y$3,0,#REF!)","v":{"$error":"#REF!"}},{"$f":"IF(#REF!>$Y$3,0,#REF!)","v":{"$error":"#REF!"}},{"$f":"IF(#REF!>$Y$3,0,#REF!)","v":{"$error":"#REF!"}},{"$f":"IF(#REF!>$Y$3,0,#REF!)","v":{"$error":"#REF!"}},{"$f":"IF(#REF!>$Y$3,0,#REF!)","v":{"$error":"#REF!"}},{"$f":"IF(#REF!>$Y$3,0,#REF!)","v":{"$error":"#REF!"}},{"$f":"IF(#REF!>$Y$3,0,#REF!)","v":{"$error":"#REF!"}},{"$f":"IF(#REF!>$Y$3,0,#REF!)","v":{"$error":"#REF!"}},{"$f":"IF(#REF!>$Y$3,0,#REF!)","v":{"$error":"#REF!"}},{"$f":"IF(#REF!>$Y$3,0,#REF!)","v":{"$error":"#REF!"}},{"$f":"IF(#REF!>$Y$3,0,#REF!)","v":{"$error":"#REF!"}},{"$f":"IF(#REF!>$Y$3,0,#REF!)","v":{"$error":"#REF!"}},{"$f":"IF(#REF!>$Y$3,0,#REF!)","v":{"$error":"#REF!"}},{"$f":"IF(#REF!>$Y$3,0,#REF!)","v":{"$error":"#REF!"}},{"$f":"IF(#REF!>$Y$3,0,#REF!)","v":{"$error":"#REF!"}},{"$f":"IF(#REF!>$Y$3,0,#REF!)","v":{"$error":"#REF!"}},{"$f":"IF(#REF!>$Y$3,0,#REF!)","v":{"$error":"#REF!"}},{"$f":"IF(#REF!>$Y$3,0,#REF!)","v":{"$error":"#REF!"}},{"$f":"IF(#REF!>$Y$3,0,#REF!)","v":{"$error":"#REF!"}},{"$f":"IF(#REF!>$Y$3,0,#REF!)","v":{"$error":"#REF!"}},{"$f":"IF(#REF!>$Y$3,0,#REF!)","v":{"$error":"#REF!"}},{"$f":"IF(#REF!>$Y$3,0,#REF!)","v":{"$error":"#REF!"}},{"$f":"IF(#REF!>$Y$3,0,#REF!)","v":{"$error":"#REF!"}},{"$f":"IF(#REF!>$Y$3,0,#REF!)","v":{"$error":"#REF!"}},{"$f":"IF(#REF!>$Y$3,0,#REF!)","v":{"$error":"#REF!"}},{"$f":"IF(#REF!>$Y$3,0,#REF!)","v":{"$error":"#REF!"}},{"$f":"IF(#REF!>$Y$3,0,#REF!)","v":{"$error":"#REF!"}},{"$f":"IF(#REF!>$Y$3,0,#REF!)","v":{"$error":"#REF!"}}]
[null,null,65,{"$f":"IF('AS1'!D69=\"\",\"\",'AS1'!D69)","v":""},{"$f":"IF('AS1'!E69=\"\",\"\",'AS1'!E69)","v":""},null,null,null,null,null,null,null,null,null,null,null,null,null,null,null,null,null,null,null,null,null,null,null,null,null,null,null,null,null,null,null,null,null,null,null,null,null,null,null,null,null,null,null,null,null,null,null,null,null,null,null,null,0,{"$f":"IF(PARCIAL1!L$8=0,0,(ROUND(((BF69*10)/PARCIAL2!L$8),1)))","v":0},null,null,0,0,0,0,0,0,0,0,0,0,0,0,0,0,0,0,0,0,0,0,0,0,0,0,0,0,0,0,0,0,0,0,0,0,0,0,0,0,0,0,0,0,0,0,0,0,0,0,0,0,0,0,{"$f":"IF(#REF!>$Y$3,0,#REF!)","v":{"$error":"#REF!"}},{"$f":"IF(#REF!>$Y$3,0,#REF!)","v":{"$error":"#REF!"}},{"$f":"IF(#REF!>$Y$3,0,#REF!)","v":{"$error":"#REF!"}},{"$f":"IF(#REF!>$Y$3,0,#REF!)","v":{"$error":"#REF!"}},{"$f":"IF(#REF!>$Y$3,0,#REF!)","v":{"$error":"#REF!"}},{"$f":"IF(#REF!>$Y$3,0,#REF!)","v":{"$error":"#REF!"}},{"$f":"IF(#REF!>$Y$3,0,#REF!)","v":{"$error":"#REF!"}},{"$f":"IF(#REF!>$Y$3,0,#REF!)","v":{"$error":"#REF!"}},{"$f":"IF(#REF!>$Y$3,0,#REF!)","v":{"$error":"#REF!"}},{"$f":"IF(#REF!>$Y$3,0,#REF!)","v":{"$error":"#REF!"}},{"$f":"IF(#REF!>$Y$3,0,#REF!)","v":{"$error":"#REF!"}},{"$f":"IF(#REF!>$Y$3,0,#REF!)","v":{"$error":"#REF!"}},{"$f":"IF(#REF!>$Y$3,0,#REF!)","v":{"$error":"#REF!"}},{"$f":"IF(#REF!>$Y$3,0,#REF!)","v":{"$error":"#REF!"}},{"$f":"IF(#REF!>$Y$3,0,#REF!)","v":{"$error":"#REF!"}},{"$f":"IF(#REF!>$Y$3,0,#REF!)","v":{"$error":"#REF!"}},{"$f":"IF(#REF!>$Y$3,0,#REF!)","v":{"$error":"#REF!"}},{"$f":"IF(#REF!>$Y$3,0,#REF!)","v":{"$error":"#REF!"}},{"$f":"IF(#REF!>$Y$3,0,#REF!)","v":{"$error":"#REF!"}},{"$f":"IF(#REF!>$Y$3,0,#REF!)","v":{"$error":"#REF!"}},{"$f":"IF(#REF!>$Y$3,0,#REF!)","v":{"$error":"#REF!"}},{"$f":"IF(#REF!>$Y$3,0,#REF!)","v":{"$error":"#REF!"}},{"$f":"IF(#REF!>$Y$3,0,#REF!)","v":{"$error":"#REF!"}},{"$f":"IF(#REF!>$Y$3,0,#REF!)","v":{"$error":"#REF!"}},{"$f":"IF(#REF!>$Y$3,0,#REF!)","v":{"$error":"#REF!"}},{"$f":"IF(#REF!>$Y$3,0,#REF!)","v":{"$error":"#REF!"}},{"$f":"IF(#REF!>$Y$3,0,#REF!)","v":{"$error":"#REF!"}},{"$f":"IF(#REF!>$Y$3,0,#REF!)","v":{"$error":"#REF!"}}]
[null,null,66,{"$f":"IF('AS1'!D70=\"\",\"\",'AS1'!D70)","v":""},{"$f":"IF('AS1'!E70=\"\",\"\",'AS1'!E70)","v":""},null,null,null,null,null,null,null,null,null,null,null,null,null,null,null,null,null,null,null,null,null,null,null,null,null,null,null,null,null,null,null,null,null,null,null,null,null,null,null,null,null,null,null,null,null,null,null,null,null,null,null,null,0,{"$f":"IF(PARCIAL1!L$8=0,0,(ROUND(((BF70*10)/PARCIAL2!L$8),1)))","v":0},null,null,{"$f":"IF(F70>$Y$3,0,F70)","v":0},0,0,0,0,0,0,0,0,0,0,0,0,0,0,0,0,0,0,0,0,0,0,0,0,0,0,0,0,0,0,0,0,0,0,0,0,0,0,0,0,0,0,0,0,0,0,0,0,0,0,0,{"$f":"IF(#REF!>$Y$3,0,#REF!)","v":{"$error":"#REF!"}},{"$f":"IF(#REF!>$Y$3,0,#REF!)","v":{"$error":"#REF!"}},{"$f":"IF(#REF!>$Y$3,0,#REF!)","v":{"$error":"#REF!"}},{"$f":"IF(#REF!>$Y$3,0,#REF!)","v":{"$error":"#REF!"}},{"$f":"IF(#REF!>$Y$3,0,#REF!)","v":{"$error":"#REF!"}},{"$f":"IF(#REF!>$Y$3,0,#REF!)","v":{"$error":"#REF!"}},{"$f":"IF(#REF!>$Y$3,0,#REF!)","v":{"$error":"#REF!"}},{"$f":"IF(#REF!>$Y$3,0,#REF!)","v":{"$error":"#REF!"}},{"$f":"IF(#REF!>$Y$3,0,#REF!)","v":{"$error":"#REF!"}},{"$f":"IF(#REF!>$Y$3,0,#REF!)","v":{"$error":"#REF!"}},{"$f":"IF(#REF!>$Y$3,0,#REF!)","v":{"$error":"#REF!"}},{"$f":"IF(#REF!>$Y$3,0,#REF!)","v":{"$error":"#REF!"}},{"$f":"IF(#REF!>$Y$3,0,#REF!)","v":{"$error":"#REF!"}},{"$f":"IF(#REF!>$Y$3,0,#REF!)","v":{"$error":"#REF!"}},{"$f":"IF(#REF!>$Y$3,0,#REF!)","v":{"$error":"#REF!"}},{"$f":"IF(#REF!>$Y$3,0,#REF!)","v":{"$error":"#REF!"}},{"$f":"IF(#REF!>$Y$3,0,#REF!)","v":{"$error":"#REF!"}},{"$f":"IF(#REF!>$Y$3,0,#REF!)","v":{"$error":"#REF!"}},{"$f":"IF(#REF!>$Y$3,0,#REF!)","v":{"$error":"#REF!"}},{"$f":"IF(#REF!>$Y$3,0,#REF!)","v":{"$error":"#REF!"}},{"$f":"IF(#REF!>$Y$3,0,#REF!)","v":{"$error":"#REF!"}},{"$f":"IF(#REF!>$Y$3,0,#REF!)","v":{"$error":"#REF!"}},{"$f":"IF(#REF!>$Y$3,0,#REF!)","v":{"$error":"#REF!"}},{"$f":"IF(#REF!>$Y$3,0,#REF!)","v":{"$error":"#REF!"}},{"$f":"IF(#REF!>$Y$3,0,#REF!)","v":{"$error":"#REF!"}},{"$f":"IF(#REF!>$Y$3,0,#REF!)","v":{"$error":"#REF!"}},{"$f":"IF(#REF!>$Y$3,0,#REF!)","v":{"$error":"#REF!"}},{"$f":"IF(#REF!>$Y$3,0,#REF!)","v":{"$error":"#REF!"}}]
[null,null,67,{"$f":"IF('AS1'!D71=\"\",\"\",'AS1'!D71)","v":""},{"$f":"IF('AS1'!E71=\"\",\"\",'AS1'!E71)","v":""},null,null,null,null,null,null,null,null,null,null,null,null,null,null,null,null,null,null,null,null,null,null,null,null,null,null,null,null,null,null,null,null,null,null,null,null,null,null,null,null,null,null,null,null,null,null,null,null,null,null,null,null,0,{"$f":"IF(PARCIAL1!L$8=0,0,(ROUND(((BF71*10)/PARCIAL2!L$8),1)))","v":0},null,null,0,0,0,0,0,0,0,0,0,0,0,0,0,0,0,0,0,0,0,0,0,0,0,0,0,0,0,0,0,0,0,0,0,0,0,0,0,0,0,0,0,0,0,0,0,0,0,0,0,0,0,0,{"$f":"IF(#REF!>$Y$3,0,#REF!)","v":{"$error":"#REF!"}},{"$f":"IF(#REF!>$Y$3,0,#REF!)","v":{"$error":"#REF!"}},{"$f":"IF(#REF!>$Y$3,0,#REF!)","v":{"$error":"#REF!"}},{"$f":"IF(#REF!>$Y$3,0,#REF!)","v":{"$error":"#REF!"}},{"$f":"IF(#REF!>$Y$3,0,#REF!)","v":{"$error":"#REF!"}},{"$f":"IF(#REF!>$Y$3,0,#REF!)","v":{"$error":"#REF!"}},{"$f":"IF(#REF!>$Y$3,0,#REF!)","v":{"$error":"#REF!"}},{"$f":"IF(#REF!>$Y$3,0,#REF!)","v":{"$error":"#REF!"}},{"$f":"IF(#REF!>$Y$3,0,#REF!)","v":{"$error":"#REF!"}},{"$f":"IF(#REF!>$Y$3,0,#REF!)","v":{"$error":"#REF!"}},{"$f":"IF(#REF!>$Y$3,0,#REF!)","v":{"$error":"#REF!"}},{"$f":"IF(#REF!>$Y$3,0,#REF!)","v":{"$error":"#REF!"}},{"$f":"IF(#REF!>$Y$3,0,#REF!)","v":{"$error":"#REF!"}},{"$f":"IF(#REF!>$Y$3,0,#REF!)","v":{"$error":"#REF!"}},{"$f":"IF(#REF!>$Y$3,0,#REF!)","v":{"$error":"#REF!"}},{"$f":"IF(#REF!>$Y$3,0,#REF!)","v":{"$error":"#REF!"}},{"$f":"IF(#REF!>$Y$3,0,#REF!)","v":{"$error":"#REF!"}},{"$f":"IF(#REF!>$Y$3,0,#REF!)","v":{"$error":"#REF!"}},{"$f":"IF(#REF!>$Y$3,0,#REF!)","v":{"$error":"#REF!"}},{"$f":"IF(#REF!>$Y$3,0,#REF!)","v":{"$error":"#REF!"}},{"$f":"IF(#REF!>$Y$3,0,#REF!)","v":{"$error":"#REF!"}},{"$f":"IF(#REF!>$Y$3,0,#REF!)","v":{"$error":"#REF!"}},{"$f":"IF(#REF!>$Y$3,0,#REF!)","v":{"$error":"#REF!"}},{"$f":"IF(#REF!>$Y$3,0,#REF!)","v":{"$error":"#REF!"}},{"$f":"IF(#REF!>$Y$3,0,#REF!)","v":{"$error":"#REF!"}},{"$f":"IF(#REF!>$Y$3,0,#REF!)","v":{"$error":"#REF!"}},{"$f":"IF(#REF!>$Y$3,0,#REF!)","v":{"$error":"#REF!"}},{"$f":"IF(#REF!>$Y$3,0,#REF!)","v":{"$error":"#REF!"}}]
[null,null,68,{"$f":"IF('AS1'!D72=\"\",\"\",'AS1'!D72)","v":""},{"$f":"IF('AS1'!E72=\"\",\"\",'AS1'!E72)","v":""},null,null,null,null,null,null,null,null,null,null,null,null,null,null,null,null,null,null,null,null,null,null,null,null,null,null,null,null,null,null,null,null,null,null,null,null,null,null,null,null,null,null,null,null,null,null,null,null,null,null,null,null,{"$f":"SUM(F72:BE72)","v":0},{"$f":"IF(PARCIAL1!L$8=0,0,(ROUND(((BF72*10)/PARCIAL2!L$8),1)))","v":0},null,null,0,0,0,0,0,0,0,0,0,0,0,0,0,0,0,0,0,0,0,0,0,0,0,0,0,0,0,0,0,0,0,0,0,0,0,0,0,0,0,0,0,0,0,0,0,0,0,0,0,0,0,0,{"$f":"IF(#REF!>$Y$3,0,#REF!)","v":{"$error":"#REF!"}},{"$f":"IF(#REF!>$Y$3,0,#REF!)","v":{"$error":"#REF!"}},{"$f":"IF(#REF!>$Y$3,0,#REF!)","v":{"$error":"#REF!"}},{"$f":"IF(#REF!>$Y$3,0,#REF!)","v":{"$error":"#REF!"}},{"$f":"IF(#REF!>$Y$3,0,#REF!)","v":{"$error":"#REF!"}},{"$f":"IF(#REF!>$Y$3,0,#REF!)","v":{"$error":"#REF!"}},{"$f":"IF(#REF!>$Y$3,0,#REF!)","v":{"$error":"#REF!"}},{"$f":"IF(#REF!>$Y$3,0,#REF!)","v":{"$error":"#REF!"}},{"$f":"IF(#REF!>$Y$3,0,#REF!)","v":{"$error":"#REF!"}},{"$f":"IF(#REF!>$Y$3,0,#REF!)","v":{"$error":"#REF!"}},{"$f":"IF(#REF!>$Y$3,0,#REF!)","v":{"$error":"#REF!"}},{"$f":"IF(#REF!>$Y$3,0,#REF!)","v":{"$error":"#REF!"}},{"$f":"IF(#REF!>$Y$3,0,#REF!)","v":{"$error":"#REF!"}},{"$f":"IF(#REF!>$Y$3,0,#REF!)","v":{"$error":"#REF!"}},{"$f":"IF(#REF!>$Y$3,0,#REF!)","v":{"$error":"#REF!"}},{"$f":"IF(#REF!>$Y$3,0,#REF!)","v":{"$error":"#REF!"}},{"$f":"IF(#REF!>$Y$3,0,#REF!)","v":{"$error":"#REF!"}},{"$f":"IF(#REF!>$Y$3,0,#REF!)","v":{"$error":"#REF!"}},{"$f":"IF(#REF!>$Y$3,0,#REF!)","v":{"$error":"#REF!"}},{"$f":"IF(#REF!>$Y$3,0,#REF!)","v":{"$error":"#REF!"}},{"$f":"IF(#REF!>$Y$3,0,#REF!)","v":{"$error":"#REF!"}},{"$f":"IF(#REF!>$Y$3,0,#REF!)","v":{"$error":"#REF!"}},{"$f":"IF(#REF!>$Y$3,0,#REF!)","v":{"$error":"#REF!"}},{"$f":"IF(#REF!>$Y$3,0,#REF!)","v":{"$error":"#REF!"}},{"$f":"IF(#REF!>$Y$3,0,#REF!)","v":{"$error":"#REF!"}},{"$f":"IF(#REF!>$Y$3,0,#REF!)","v":{"$error":"#REF!"}},{"$f":"IF(#REF!>$Y$3,0,#REF!)","v":{"$error":"#REF!"}},{"$f":"IF(#REF!>$Y$3,0,#REF!)","v":{"$error":"#REF!"}}]
[null,null,69,{"$f":"IF('AS1'!D73=\"\",\"\",'AS1'!D73)","v":""},{"$f":"IF('AS1'!E73=\"\",\"\",'AS1'!E73)","v":""},null,null,null,null,null,null,null,null,null,null,null,null,null,null,null,null,null,null,null,null,null,null,null,null,null,null,null,null,null,null,null,null,null,null,null,null,null,null,null,null,null,null,null,null,null,null,null,null,null,null,null,null,0,{"$f":"IF(PARCIAL1!L$8=0,0,(ROUND(((BF73*10)/PARCIAL2!L$8),1)))","v":0},null,null,0,0,0,0,0,0,0,0,0,0,0,0,0,0,0,0,0,0,0,0,0,0,0,0,0,0,0,0,0,0,0,0,0,0,0,0,0,0,0,0,0,0,0,0,0,0,0,0,0,0,0,0,{"$f":"IF(#REF!>$Y$3,0,#REF!)","v":{"$error":"#REF!"}},{"$f":"IF(#REF!>$Y$3,0,#REF!)","v":{"$error":"#REF!"}},{"$f":"IF(#REF!>$Y$3,0,#REF!)","v":{"$error":"#REF!"}},{"$f":"IF(#REF!>$Y$3,0,#REF!)","v":{"$error":"#REF!"}},{"$f":"IF(#REF!>$Y$3,0,#REF!)","v":{"$error":"#REF!"}},{"$f":"IF(#REF!>$Y$3,0,#REF!)","v":{"$error":"#REF!"}},{"$f":"IF(#REF!>$Y$3,0,#REF!)","v":{"$error":"#REF!"}},{"$f":"IF(#REF!>$Y$3,0,#REF!)","v":{"$error":"#REF!"}},{"$f":"IF(#REF!>$Y$3,0,#REF!)","v":{"$error":"#REF!"}},{"$f":"IF(#REF!>$Y$3,0,#REF!)","v":{"$error":"#REF!"}},{"$f":"IF(#REF!>$Y$3,0,#REF!)","v":{"$error":"#REF!"}},{"$f":"IF(#REF!>$Y$3,0,#REF!)","v":{"$error":"#REF!"}},{"$f":"IF(#REF!>$Y$3,0,#REF!)","v":{"$error":"#REF!"}},{"$f":"IF(#REF!>$Y$3,0,#REF!)","v":{"$error":"#REF!"}},{"$f":"IF(#REF!>$Y$3,0,#REF!)","v":{"$error":"#REF!"}},{"$f":"IF(#REF!>$Y$3,0,#REF!)","v":{"$error":"#REF!"}},{"$f":"IF(#REF!>$Y$3,0,#REF!)","v":{"$error":"#REF!"}},{"$f":"IF(#REF!>$Y$3,0,#REF!)","v":{"$error":"#REF!"}},{"$f":"IF(#REF!>$Y$3,0,#REF!)","v":{"$error":"#REF!"}},{"$f":"IF(#REF!>$Y$3,0,#REF!)","v":{"$error":"#REF!"}},{"$f":"IF(#REF!>$Y$3,0,#REF!)","v":{"$error":"#REF!"}},{"$f":"IF(#REF!>$Y$3,0,#REF!)","v":{"$error":"#REF!"}},{"$f":"IF(#REF!>$Y$3,0,#REF!)","v":{"$error":"#REF!"}},{"$f":"IF(#REF!>$Y$3,0,#REF!)","v":{"$error":"#REF!"}},{"$f":"IF(#REF!>$Y$3,0,#REF!)","v":{"$error":"#REF!"}},{"$f":"IF(#REF!>$Y$3,0,#REF!)","v":{"$error":"#REF!"}},{"$f":"IF(#REF!>$Y$3,0,#REF!)","v":{"$error":"#REF!"}},{"$f":"IF(#REF!>$Y$3,0,#REF!)","v":{"$error":"#REF!"}}]
[null,null,70,{"$f":"IF('AS1'!D74=\"\",\"\",'AS1'!D74)","v":""},{"$f":"IF('AS1'!E74=\"\",\"\",'AS1'!E74)","v":""},null,null,null,null,null,null,null,null,null,null,null,null,null,null,null,null,null,null,null,null,null,null,null,null,null,null,null,null,null,null,null,null,null,null,null,null,null,null,null,null,null,null,null,null,null,null,null,null,null,null,null,null,0,{"$f":"IF(PARCIAL1!L$8=0,0,(ROUND(((BF74*10)/PARCIAL2!L$8),1)))","v":0},null,null,0,0,0,0,0,0,0,0,0,0,0,0,0,0,0,0,0,0,0,0,0,0,0,0,0,0,0,0,0,0,0,0,0,0,0,0,0,0,0,0,0,0,0,0,0,0,0,0,0,0,0,0,{"$f":"IF(#REF!>$Y$3,0,#REF!)","v":{"$error":"#REF!"}},{"$f":"IF(#REF!>$Y$3,0,#REF!)","v":{"$error":"#REF!"}},{"$f":"IF(#REF!>$Y$3,0,#REF!)","v":{"$error":"#REF!"}},{"$f":"IF(#REF!>$Y$3,0,#REF!)","v":{"$error":"#REF!"}},{"$f":"IF(#REF!>$Y$3,0,#REF!)","v":{"$error":"#REF!"}},{"$f":"IF(#REF!>$Y$3,0,#REF!)","v":{"$error":"#REF!"}},{"$f":"IF(#REF!>$Y$3,0,#REF!)","v":{"$error":"#REF!"}},{"$f":"IF(#REF!>$Y$3,0,#REF!)","v":{"$error":"#REF!"}},{"$f":"IF(#REF!>$Y$3,0,#REF!)","v":{"$error":"#REF!"}},{"$f":"IF(#REF!>$Y$3,0,#REF!)","v":{"$error":"#REF!"}},{"$f":"IF(#REF!>$Y$3,0,#REF!)","v":{"$error":"#REF!"}},{"$f":"IF(#REF!>$Y$3,0,#REF!)","v":{"$error":"#REF!"}},{"$f":"IF(#REF!>$Y$3,0,#REF!)","v":{"$error":"#REF!"}},{"$f":"IF(#REF!>$Y$3,0,#REF!)","v":{"$error":"#REF!"}},{"$f":"IF(#REF!>$Y$3,0,#REF!)","v":{"$error":"#REF!"}},{"$f":"IF(#REF!>$Y$3,0,#REF!)","v":{"$error":"#REF!"}},{"$f":"IF(#REF!>$Y$3,0,#REF!)","v":{"$error":"#REF!"}},{"$f":"IF(#REF!>$Y$3,0,#REF!)","v":{"$error":"#REF!"}},{"$f":"IF(#REF!>$Y$3,0,#REF!)","v":{"$error":"#REF!"}},{"$f":"IF(#REF!>$Y$3,0,#REF!)","v":{"$error":"#REF!"}},{"$f":"IF(#REF!>$Y$3,0,#REF!)","v":{"$error":"#REF!"}},{"$f":"IF(#REF!>$Y$3,0,#REF!)","v":{"$error":"#REF!"}},{"$f":"IF(#REF!>$Y$3,0,#REF!)","v":{"$error":"#REF!"}},{"$f":"IF(#REF!>$Y$3,0,#REF!)","v":{"$error":"#REF!"}},{"$f":"IF(#REF!>$Y$3,0,#REF!)","v":{"$error":"#REF!"}},{"$f":"IF(#REF!>$Y$3,0,#REF!)","v":{"$error":"#REF!"}},{"$f":"IF(#REF!>$Y$3,0,#REF!)","v":{"$error":"#REF!"}},{"$f":"IF(#REF!>$Y$3,0,#REF!)","v":{"$error":"#REF!"}}]

{"sheet":"DOC2","index":8,"n_rows":75,"n_cols":18,"rows_kept":75,"cut":false,"hidden":false,"merged":[[1,2,1,17],[2,2,2,17],[3,2,4,2],[3,3,4,3],[3,4,4,4],[3,15,4,15],[3,16,4,16],[3,17,4,17]]}
[]
[null,null,"Aprendizaje\n en contacto\n con el\n docente - SEGUNDO PARCIAL"]
[null,null,"Conferencias, Seminarios, Estudios de Casos, Foros, Clases en Línea, Servicios realizados en escenarios laborables. Experiencias colectivas en proyectos: sistematización de prácticas de investigación-intervención, proyectos de integración de saberes, construcción de modelos y prototipos, proyectos de problematización, resolución de problemas, entornos virtuales, entre otros. Evaluaciones orales, escritas entre otras."]
[null,null,"N","NRO DE CÉDULA","NOMINA",1,2,3,4,5,6,7,8,9,10,"suma","PROMEDIO sobre 10","EQUIVALENCIA sobre 3,5"]
[null,null,null,null,null,"Parcial II","Exp. \nHem.  Obst. Primera y II mitad del emb.","Exposición PAE II mitad del embarazo ","Lección RMAP","Exp. Rotura uterina+afecciones ovulares","Exp. Amenaza de PP/Incomp.Rh ","Exp.Hem.PP+Diabetes Gest."," Hiperemesi Gravídica+ Cardiopatías /lección","Ca. De cérvix ","Ca. Mama"]
[null,null,1,{"$f":"IF('AS1'!D5=\"\",\"\",'AS1'!D5)","v":""},{"$f":"IF('AS1'!E5=\"\",\"\",'AS1'!E5)","v":"DAQUILEMA LONDO SHIRLEY ESTEFAFANÍA"},8,9.6,5,0,8.1999999999999993,null,9.4,6,null,8.8000000000000007,{"$f":"IF(COUNT(F6:O6)=0,\"\",SUM(F6:O6))","v":55},{"$f":"IF(COUNT(F6:O6)=0,0,ROUND(P6/COUNT(F6:O6),2))","v":6.88},{"$f":"(Q6*3.5)/10","v":2.4079999999999999}]
[null,null,2,{"$f":"IF('AS1'!D6=\"\",\"\",'AS1'!D6)","v":""},{"$f":"IF('AS1'!E6=\"\",\"\",'AS1'!E6)","v":"GOYES ORTIZ NATASHA DAYANA"},7.2,9.4,5,0,9.4,null,9,9.6,null,9,58.6,7.33,{"$f":"(Q7*3.5)/10","v":2.5655000000000001}]
[null,null,3,{"$f":"IF('AS1'!D7=\"\",\"\",'AS1'!D7)","v":""},{"$f":"IF('AS1'!E7=\"\",\"\",'AS1'!E7)","v":"GUADALUPE RUIZ YULISA NATALY"},5.5,8.8000000000000007,5,0,9.6,null,8.1999999999999993,9,null,8.4,54.499999999999993,6.81,{"$f":"(Q8*3.5)/10","v":2.3834999999999997}]
[null,null,4,{"$f":"IF('AS1'!D8=\"\",\"\",'AS1'!D8)","v":""},{"$f":"IF('AS1'!E8=\"\",\"\",'AS1'!E8)","v":"MELO CHAVEZ KEVIN JOSUE"},9.5,6.2,5,0,8.8000000000000007,null,6.8,9.4,null,8.6,54.3,6.79,2.3765000000000001]
[null,null,5,{"$f":"IF('AS1'!D9=\"\",\"\",'AS1'!D9)","v":""},{"$f":"IF('AS1'!E9=\"\",\"\",'AS1'!E9)","v":"MULLO PAUCAR ADRIANA ANABEL"},10,9.6,5,0,null,7.8,9.6,null,7.8,8.8000000000000007,58.599999999999994,7.33,2.5655000000000001]
[null,null,6,{"$f":"IF('AS1'!D10=\"\",\"\",'AS1'!D10)","v":""},{"$f":"IF('AS1'!E10=\"\",\"\",'AS1'!E10)","v":"NARANJO PALACIOS FERNANDA BRIGUITTE"},null,null,null,null,null,null,null,null,null,null,"",0,0]
[null,null,7,{"$f":"IF('AS1'!D11=\"\",\"\",'AS1'!D11)","v":""},{"$f":"IF('AS1'!E11=\"\",\"\",'AS1'!E11)","v":"SOTO VARGAS ERIKA SAMANTA"},7,9.1999999999999993,5,0,null,9.8000000000000007,8.8000000000000007,null,9.6,9,58.4,7.3,2.5550000000000002]
[null,null,8,{"$f":"IF('AS1'!D12=\"\",\"\",'AS1'!D12)","v":""},{"$f":"IF('AS1'!E12=\"\",\"\",'AS1'!E12)","v":"VALLEJO ORDOÑEZ SAYONARA ELIZABETH"},5.5,8,5,0,null,7.4,4.2,0,6.2,8,44.3,4.92,1.722]
[null,null,9,{"$f":"IF('AS1'!D13=\"\",\"\",'AS1'!D13)","v":""},{"$f":"IF('AS1'!E13=\"\",\"\",'AS1'!E13)","v":""},null,null,null,null,null,null,null,null,null,null,"",0,0]
[null,null,10,{"$f":"IF('AS1'!D14=\"\",\"\",'AS1'!D14)","v":""},{"$f":"IF('AS1'!E14=\"\",\"\",'AS1'!E14)","v":""},null,null,null,null,null,null,null,null,null,null,"",0,0]
[null,null,11,{"$f":"IF('AS1'!D15=\"\",\"\",'AS1'!D15)","v":""},{"$f":"IF('AS1'!E15=\"\",\"\",'AS1'!E15)","v":""},null,null,null,null,null,null,null,null,null,null,"",0,0]
[null,null,12,{"$f":"IF('AS1'!D16=\"\",\"\",'AS1'!D16)","v":""},{"$f":"IF('AS1'!E16=\"\",\"\",'AS1'!E16)","v":""},null,null,null,null,null,null,null,null,null,null,"",0,0]
[null,null,13,{"$f":"IF('AS1'!D17=\"\",\"\",'AS1'!D17)","v":""},{"$f":"IF('AS1'!E17=\"\",\"\",'AS1'!E17)","v":""},null,null,null,null,null,null,null,null,null,null,"",0,0]
[null,null,14,{"$f":"IF('AS1'!D18=\"\",\"\",'AS1'!D18)","v":""},{"$f":"IF('AS1'!E18=\"\",\"\",'AS1'!E18)","v":""},null,null,null,null,null,null,null,null,null,null,"",0,0]
[null,null,15,{"$f":"IF('AS1'!D19=\"\",\"\",'AS1'!D19)","v":""},{"$f":"IF('AS1'!E19=\"\",\"\",'AS1'!E19)","v":""},null,null,null,null,null,null,null,null,null,null,"",0,0]
[null,null,16,{"$f":"IF('AS1'!D20=\"\",\"\",'AS1'!D20)","v":""},{"$f":"IF('AS1'!E20=\"\",\"\",'AS1'!E20)","v":""},null,null,null,null,null,null,null,null,null,null,"",0,0]
[null,null,17,{"$f":"IF('AS1'!D21=\"\",\"\",'AS1'!D21)","v":""},{"$f":"IF('AS1'!E21=\"\",\"\",'AS1'!E21)","v":""},null,null,null,null,null,null,null,null,null,null,"",0,0]
[null,null,18,{"$f":"IF('AS1'!D22=\"\",\"\",'AS1'!D22)","v":""},{"$f":"IF('AS1'!E22=\"\",\"\",'AS1'!E22)","v":""},null,null,null,null,null,null,null,null,null,null,"",0,0]
[null,null,19,{"$f":"IF('AS1'!D23=\"\",\"\",'AS1'!D23)","v":""},{"$f":"IF('AS1'!E23=\"\",\"\",'AS1'!E23)","v":""},null,null,null,null,null,null,null,null,null,null,"",0,0]
[null,null,20,{"$f":"IF('AS1'!D24=\"\",\"\",'AS1'!D24)","v":""},{"$f":"IF('AS1'!E24=\"\",\"\",'AS1'!E24)","v":""},null,null,null,null,null,null,null,null,null,null,"",0,0]
[null,null,21,{"$f":"IF('AS1'!D25=\"\",\"\",'AS1'!D25)","v":""},{"$f":"IF('AS1'!E25=\"\",\"\",'AS1'!E25)","v":""},null,null,null,null,null,null,null,null,null,null,"",0,0]
[null,null,22,{"$f":"IF('AS1'!D26=\"\",\"\",'AS1'!D26)","v":""},{"$f":"IF('AS1'!E26=\"\",\"\",'AS1'!E26)","v":""},null,null,null,null,null,null,null,null,null,null,"",0,0]
[null,null,23,{"$f":"IF('AS1'!D27=\"\",\"\",'AS1'!D27)","v":""},{"$f":"IF('AS1'!E27=\"\",\"\",'AS1'!E27)","v":""},null,null,null,null,null,null,null,null,null,null,"",0,0]
[null,null,24,{"$f":"IF('AS1'!D28=\"\",\"\",'AS1'!D28)","v":""},{"$f":"IF('AS1'!E28=\"\",\"\",'AS1'!E28)","v":""},null,null,null,null,null,null,null,null,null,null,"",0,0]
[null,null,25,{"$f":"IF('AS1'!D29=\"\",\"\",'AS1'!D29)","v":""},{"$f":"IF('AS1'!E29=\"\",\"\",'AS1'!E29)","v":""},null,null,null,null,null,null,null,null,null,null,"",0,0]
[null,null,26,{"$f":"IF('AS1'!D30=\"\",\"\",'AS1'!D30)","v":""},{"$f":"IF('AS1'!E30=\"\",\"\",'AS1'!E30)","v":""},null,null,null,null,null,null,null,null,null,null,"",0,0]
[null,null,27,{"$f":"IF('AS1'!D31=\"\",\"\",'AS1'!D31)","v":""},{"$f":"IF('AS1'!E31=\"\",\"\",'AS1'!E31)","v":""},null,null,null,null,null,null,null,null,null,null,"",0,0]
[null,null,28,{"$f":"IF('AS1'!D32=\"\",\"\",'AS1'!D32)","v":""},{"$f":"IF('AS1'!E32=\"\",\"\",'AS1'!E32)","v":""},null,null,null,null,null,null,null,null,null,null,"",0,0]
[null,null,29,{"$f":"IF('AS1'!D33=\"\",\"\",'AS1'!D33)","v":""},{"$f":"IF('AS1'!E33=\"\",\"\",'AS1'!E33)","v":""},null,null,null,null,null,null,null,null,null,null,"",0,0]
[null,null,30,{"$f":"IF('AS1'!D34=\"\",\"\",'AS1'!D34)","v":""},{"$f":"IF('AS1'!E34=\"\",\"\",'AS1'!E34)","v":""},null,null,null,null,null,null,null,null,null,null,"",0,0]
[null,null,31,{"$f":"IF('AS1'!D35=\"\",\"\",'AS1'!D35)","v":""},{"$f":"IF('AS1'!E35=\"\",\"\",'AS1'!E35)","v":""},null,null,null,null,null,null,null,null,null,null,"",0,0]
[null,null,32,{"$f":"IF('AS1'!D36=\"\",\"\",'AS1'!D36)","v":""},{"$f":"IF('AS1'!E36=\"\",\"\",'AS1'!E36)","v":""},null,null,null,null,null,null,null,null,null,null,"",0,0]
[null,null,33,{"$f":"IF('AS1'!D37=\"\",\"\",'AS1'!D37)","v":""},{"$f":"IF('AS1'!E37=\"\",\"\",'AS1'!E37)","v":""},null,null,null,null,null,null,null,null,null,null,{"$f":"IF(COUNT(F38:O38)=0,\"\",SUM(F38:O38))","v":""},{"$f":"IF(COUNT(F38:O38)=0,0,ROUND(P38/COUNT(F38:O38),2))","v":0},0]
[null,null,34,{"$f":"IF('AS1'!D38=\"\",\"\",'AS1'!D38)","v":""},{"$f":"IF('AS1'!E38=\"\",\"\",'AS1'!E38)","v":""},null,null,null,null,null,null,null,null,null,null,"",0,0]
[null,null,35,{"$f":"IF('AS1'!D39=\"\",\"\",'AS1'!D39)","v":""},{"$f":"IF('AS1'!E39=\"\",\"\",'AS1'!E39)","v":""},null,null,null,null,null,null,null,null,null,null,"",0,0]
[null,null,36,{"$f":"IF('AS1'!D40=\"\",\"\",'AS1'!D40)","v":""},{"$f":"IF('AS1'!E40=\"\",\"\",'AS1'!E40)","v":""},null,null,null,null,null,null,null,null,null,null,"",0,0]
[null,null,37,{"$f":"IF('AS1'!D41=\"\",\"\",'AS1'!D41)","v":""},{"$f":"IF('AS1'!E41=\"\",\"\",'AS1'!E41)","v":""},null,null,null,null,null,null,null,null,null,null,"",0,0]
[null,null,38,{"$f":"IF('AS1'!D42=\"\",\"\",'AS1'!D42)","v":""},{"$f":"IF('AS1'!E42=\"\",\"\",'AS1'!E42)","v":""},null,null,null,null,null,null,null,null,null,null,"",0,0]
[null,null,39,{"$f":"IF('AS1'!D43=\"\",\"\",'AS1'!D43)","v":""},{"$f":"IF('AS1'!E43=\"\",\"\",'AS1'!E43)","v":""},null,null,null,null,null,null,null,null,null,null,"",0,0]
[null,null,40,{"$f":"IF('AS1'!D44=\"\",\"\",'AS1'!D44)","v":""},{"$f":"IF('AS1'!E44=\"\",\"\",'AS1'!E44)","v":""},null,null,null,null,null,null,null,null,null,null,"",0,0]
[null,null,41,{"$f":"IF('AS1'!D45=\"\",\"\",'AS1'!D45)","v":""},{"$f":"IF('AS1'!E45=\"\",\"\",'AS1'!E45)","v":""},null,null,null,null,null,null,null,null,null,null,"",0,0]
[null,null,42,{"$f":"IF('AS1'!D46=\"\",\"\",'AS1'!D46)","v":""},{"$f":"IF('AS1'!E46=\"\",\"\",'AS1'!E46)","v":""},null,null,null,null,null,null,null,null,null,null,"",0,0]
[null,null,43,{"$f":"IF('AS1'!D47=\"\",\"\",'AS1'!D47)","v":""},{"$f":"IF('AS1'!E47=\"\",\"\",'AS1'!E47)","v":""},null,null,null,null,null,null,null,null,null,null,"",0,0]
[null,null,44,{"$f":"IF('AS1'!D48=\"\",\"\",'AS1'!D48)","v":""},{"$f":"IF('AS1'!E48=\"\",\"\",'AS1'!E48)","v":""},null,null,null,null,null,null,null,null,null,null,"",0,0]
[null,null,45,{"$f":"IF('AS1'!D49=\"\",\"\",'AS1'!D49)","v":""},{"$f":"IF('AS1'!E49=\"\",\"\",'AS1'!E49)","v":""},null,null,null,null,null,null,null,null,null,null,"",0,0]
[null,null,46,{"$f":"IF('AS1'!D50=\"\",\"\",'AS1'!D50)","v":""},{"$f":"IF('AS1'!E50=\"\",\"\",'AS1'!E50)","v":""},null,null,null,null,null,null,null,null,null,null,"",0,0]
[null,null,47,{"$f":"IF('AS1'!D51=\"\",\"\",'AS1'!D51)","v":""},{"$f":"IF('AS1'!E51=\"\",\"\",'AS1'!E51)","v":""},null,null,null,null,null,null,null,null,null,null,"",0,0]
[null,null,48,{"$f":"IF('AS1'!D52=\"\",\"\",'AS1'!D52)","v":""},{"$f":"IF('AS1'!E52=\"\",\"\",'AS1'!E52)","v":""},null,null,null,null,null,null,null,null,null,null,"",0,0]
[null,null,49,{"$f":"IF('AS1'!D53=\"\",\"\",'AS1'!D53)","v":""},{"$f":"IF('AS1'!E53=\"\",\"\",'AS1'!E53)","v":""},null,null,null,null,null,null,null,null,null,null,"",0,0]
[null,null,50,{"$f":"IF('AS1'!D54=\"\",\"\",'AS1'!D54)","v":""},{"$f":"IF('AS1'!E54=\"\",\"\",'AS1'!E54)","v":""},null,null,null,null,null,null,null,null,null,null,"",0,0]
[null,null,51,{"$f":"IF('AS1'!D55=\"\",\"\",'AS1'!D55)","v":""},{"$f":"IF('AS1'!E55=\"\",\"\",'AS1'!E55)","v":""},null,null,null,null,null,null,null,null,null,null,"",0,0]
[null,null,52,{"$f":"IF('AS1'!D56=\"\",\"\",'AS1'!D56)","v":""},{"$f":"IF('AS1'!E56=\"\",\"\",'AS1'!E56)","v":""},null,null,null,null,null,null,null,null,null,null,"",0,0]
[null,null,53,{"$f":"IF('AS1'!D57=\"\",\"\",'AS1'!D57)","v":""},{"$f":"IF('AS1'!E57=\"\",\"\",'AS1'!E57)","v":""},null,null,null,null,null,null,null,null,null,null,"",0,0]
[null,null,54,{"$f":"IF('AS1'!D58=\"\",\"\",'AS1'!D58)","v":""},{"$f":"IF('AS1'!E58=\"\",\"\",'AS1'!E58)","v":""},null,null,null,null,null,null,null,null,null,null,"",0,0]
[null,null,55,{"$f":"IF('AS1'!D59=\"\",\"\",'AS1'!D59)","v":""},{"$f":"IF('AS1'!E59=\"\",\"\",'AS1'!E59)","v":""},null,null,null,null,null,null,null,null,null,null,"",0,0]
[null,null,56,{"$f":"IF('AS1'!D60=\"\",\"\",'AS1'!D60)","v":""},{"$f":"IF('AS1'!E60=\"\",\"\",'AS1'!E60)","v":""},null,null,null,null,null,null,null,null,null,null,"",0,0]
[null,null,57,{"$f":"IF('AS1'!D61=\"\",\"\",'AS1'!D61)","v":""},{"$f":"IF('AS1'!E61=\"\",\"\",'AS1'!E61)","v":""},null,null,null,null,null,null,null,null,null,null,"",0,0]
[null,null,58,{"$f":"IF('AS1'!D62=\"\",\"\",'AS1'!D62)","v":""},{"$f":"IF('AS1'!E62=\"\",\"\",'AS1'!E62)","v":""},null,null,null,null,null,null,null,null,null,null,"",0,0]
[null,null,59,{"$f":"IF('AS1'!D63=\"\",\"\",'AS1'!D63)","v":""},{"$f":"IF('AS1'!E63=\"\",\"\",'AS1'!E63)","v":""},null,null,null,null,null,null,null,null,null,null,"",0,0]
[null,null,60,{"$f":"IF('AS1'!D64=\"\",\"\",'AS1'!D64)","v":""},{"$f":"IF('AS1'!E64=\"\",\"\",'AS1'!E64)","v":""},null,null,null,null,null,null,null,null,null,null,"",0,0]
[null,null,61,{"$f":"IF('AS1'!D65=\"\",\"\",'AS1'!D65)","v":""},{"$f":"IF('AS1'!E65=\"\",\"\",'AS1'!E65)","v":""},null,null,null,null,null,null,null,null,null,null,"",0,0]
[null,null,62,{"$f":"IF('AS1'!D66=\"\",\"\",'AS1'!D66)","v":""},{"$f":"IF('AS1'!E66=\"\",\"\",'AS1'!E66)","v":""},null,null,null,null,null,null,null,null,null,null,"",0,0]
[null,null,63,{"$f":"IF('AS1'!D67=\"\",\"\",'AS1'!D67)","v":""},{"$f":"IF('AS1'!E67=\"\",\"\",'AS1'!E67)","v":""},null,null,null,null,null,null,null,null,null,null,"",0,0]
[null,null,64,{"$f":"IF('AS1'!D68=\"\",\"\",'AS1'!D68)","v":""},{"$f":"IF('AS1'!E68=\"\",\"\",'AS1'!E68)","v":""},null,null,null,null,null,null,null,null,null,null,"",0,0]
[null,null,65,{"$f":"IF('AS1'!D69=\"\",\"\",'AS1'!D69)","v":""},{"$f":"IF('AS1'!E69=\"\",\"\",'AS1'!E69)","v":""},null,null,null,null,null,null,null,null,null,null,{"$f":"IF(COUNT(F70:O70)=0,\"\",SUM(F70:O70))","v":""},{"$f":"IF(COUNT(F70:O70)=0,0,ROUND(P70/COUNT(F70:O70),2))","v":0},0]
[null,null,66,{"$f":"IF('AS1'!D70=\"\",\"\",'AS1'!D70)","v":""},{"$f":"IF('AS1'!E70=\"\",\"\",'AS1'!E70)","v":""},null,null,null,null,null,null,null,null,null,null,"",0,0]
[null,null,67,{"$f":"IF('AS1'!D71=\"\",\"\",'AS1'!D71)","v":""},{"$f":"IF('AS1'!E71=\"\",\"\",'AS1'!E71)","v":""},null,null,null,null,null,null,null,null,null,null,"",0,{"$f":"(Q72*3.5)/10","v":0}]
[null,null,68,{"$f":"IF('AS1'!D72=\"\",\"\",'AS1'!D72)","v":""},{"$f":"IF('AS1'!E72=\"\",\"\",'AS1'!E72)","v":""},null,null,null,null,null,null,null,null,null,null,"",0,0]
[null,null,69,{"$f":"IF('AS1'!D73=\"\",\"\",'AS1'!D73)","v":""},{"$f":"IF('AS1'!E73=\"\",\"\",'AS1'!E73)","v":""},null,null,null,null,null,null,null,null,null,null,"",0,0]
[null,null,70,{"$f":"IF('AS1'!D74=\"\",\"\",'AS1'!D74)","v":""},{"$f":"IF('AS1'!E74=\"\",\"\",'AS1'!E74)","v":""},null,null,null,null,null,null,null,null,null,null,"",0,0]

{"sheet":"PRAC2","index":9,"n_rows":75,"n_cols":18,"rows_kept":75,"cut":false,"hidden":false,"merged":[[1,2,1,17],[2,2,2,17],[3,2,4,2],[3,3,4,3],[3,4,4,4],[3,15,4,15],[3,16,4,16],[3,17,4,17]]}
[]
[null,null,"Aprendizaje \npráctico experimental - SEGUNDO PARCIAL"]
[null,null,"Actividades desarrolladas en escenarios experimentales o laboratorios, prácticas de campo, trabajos de observación, resolución de problemas, talleres, manejo de base de datos y acervos bibliográficos entre otros. "]
[null,null,"N","NRO DE CÉDULA","NOMINA",1,2,3,4,5,6,7,8,9,10,"suma","PROMEDIO sobre 10","EQUIVALENCIA sobre 3,5"]
[null,null,null,null,null,"4/dic.","11/dic.","18/dic. Lic Londo","2025-01-08","2025-01-15","2025-01-22","2025-01-29","2025-02-05"]
[null,null,1,{"$f":"IF('AS1'!D5=\"\",\"\",'AS1'!D5)","v":""},{"$f":"IF('AS1'!E5=\"\",\"\",'AS1'!E5)","v":"DAQUILEMA LONDO SHIRLEY ESTEFAFANÍA"},6.3,8,7.35,7.1,8.15,8.25,8.35,7.7,null,null,{"$f":"IF(COUNT(F6:O6)=0,\"\",SUM(F6:O6))","v":61.2},{"$f":"IF(COUNT(F6:O6)=0,0,ROUND(P6/COUNT(F6:O6),2))","v":7.65},{"$f":"(Q6*3.5)/10","v":2.6775000000000002}]
[null,null,2,{"$f":"IF('AS1'!D6=\"\",\"\",'AS1'!D6)","v":""},{"$f":"IF('AS1'!E6=\"\",\"\",'AS1'!E6)","v":"GOYES ORTIZ NATASHA DAYANA"},7,null,null,8.5,8.65,8.1,8.75,9.3000000000000007,null,null,50.3,8.3800000000000008,{"$f":"(Q7*3.5)/10","v":2.9330000000000003}]
[null,null,3,{"$f":"IF('AS1'!D7=\"\",\"\",'AS1'!D7)","v":""},{"$f":"IF('AS1'!E7=\"\",\"\",'AS1'!E7)","v":"GUADALUPE RUIZ YULISA NATALY"},5.0999999999999996,8.1999999999999993,6.4,6,7.55,6.5,6.25,7.2,null,null,53.2,6.65,{"$f":"(Q8*3.5)/10","v":2.3275000000000001}]
[null,null,4,{"$f":"IF('AS1'!D8=\"\",\"\",'AS1'!D8)","v":""},{"$f":"IF('AS1'!E8=\"\",\"\",'AS1'!E8)","v":"MELO CHAVEZ KEVIN JOSUE"},6.3,7.8,7.05,6.35,7.1,7.8,null,8.4,null,null,50.8,7.26,2.5409999999999999]
[null,null,5,{"$f":"IF('AS1'!D9=\"\",\"\",'AS1'!D9)","v":""},{"$f":"IF('AS1'!E9=\"\",\"\",'AS1'!E9)","v":"MULLO PAUCAR ADRIANA ANABEL"},8.5,7.14,7.1,8,6.9,7,8.1999999999999993,6.2,null,null,59.040000000000006,7.38,2.5829999999999997]
[null,null,6,{"$f":"IF('AS1'!D10=\"\",\"\",'AS1'!D10)","v":""},{"$f":"IF('AS1'!E10=\"\",\"\",'AS1'!E10)","v":"NARANJO PALACIOS FERNANDA BRIGUITTE"},null,null,null,null,null,null,null,null,null,null,"",0,0]
[null,null,7,{"$f":"IF('AS1'!D11=\"\",\"\",'AS1'!D11)","v":""},{"$f":"IF('AS1'!E11=\"\",\"\",'AS1'!E11)","v":"SOTO VARGAS ERIKA SAMANTA"},7.85,7.35,7.35,7.8,8.6,7,7.3,7.95,null,null,61.199999999999996,7.65,2.6775000000000002]
[null,null,8,{"$f":"IF('AS1'!D12=\"\",\"\",'AS1'!D12)","v":""},{"$f":"IF('AS1'!E12=\"\",\"\",'AS1'!E12)","v":"VALLEJO ORDOÑEZ SAYONARA ELIZABETH"},7.05,6.75,7.8,7.4,5,7,4.8,6.8,null,null,{"$f":"IF(COUNT(F13:O13)=0,\"\",SUM(F13:O13))","v":52.599999999999994},{"$f":"IF(COUNT(F13:O13)=0,0,ROUND(P13/COUNT(F13:O13),2))","v":6.58},2.3029999999999999]
[null,null,9,{"$f":"IF('AS1'!D13=\"\",\"\",'AS1'!D13)","v":""},{"$f":"IF('AS1'!E13=\"\",\"\",'AS1'!E13)","v":""},null,null,null,null,null,null,null,null,null,null,"",0,0]
[null,null,10,{"$f":"IF('AS1'!D14=\"\",\"\",'AS1'!D14)","v":""},{"$f":"IF('AS1'!E14=\"\",\"\",'AS1'!E14)","v":""},null,null,null,null,null,null,null,null,null,null,"",0,0]
[null,null,11,{"$f":"IF('AS1'!D15=\"\",\"\",'AS1'!D15)","v":""},{"$f":"IF('AS1'!E15=\"\",\"\",'AS1'!E15)","v":""},null,null,null,null,null,null,null,null,null,null,"",0,0]
[null,null,12,{"$f":"IF('AS1'!D16=\"\",\"\",'AS1'!D16)","v":""},{"$f":"IF('AS1'!E16=\"\",\"\",'AS1'!E16)","v":""},null,null,null,null,null,null,null,null,null,null,"",0,0]
[null,null,13,{"$f":"IF('AS1'!D17=\"\",\"\",'AS1'!D17)","v":""},{"$f":"IF('AS1'!E17=\"\",\"\",'AS1'!E17)","v":""},null,null,null,null,null,null,null,null,null,null,"",0,0]
[null,null,14,{"$f":"IF('AS1'!D18=\"\",\"\",'AS1'!D18)","v":""},{"$f":"IF('AS1'!E18=\"\",\"\",'AS1'!E18)","v":""},null,null,null,null,null,null,null,null,null,null,"",0,0]
[null,null,15,{"$f":"IF('AS1'!D19=\"\",\"\",'AS1'!D19)","v":""},{"$f":"IF('AS1'!E19=\"\",\"\",'AS1'!E19)","v":""},null,null,null,null,null,null,null,null,null,null,"",0,0]
[null,null,16,{"$f":"IF('AS1'!D20=\"\",\"\",'AS1'!D20)","v":""},{"$f":"IF('AS1'!E20=\"\",\"\",'AS1'!E20)","v":""},null,null,null,null,null,null,null,null,null,null,"",0,0]
[null,null,17,{"$f":"IF('AS1'!D21=\"\",\"\",'AS1'!D21)","v":""},{"$f":"IF('AS1'!E21=\"\",\"\",'AS1'!E21)","v":""},null,null,null,null,null,null,null,null,null,null,"",0,0]
[null,null,18,{"$f":"IF('AS1'!D22=\"\",\"\",'AS1'!D22)","v":""},{"$f":"IF('AS1'!E22=\"\",\"\",'AS1'!E22)","v":""},null,null,null,null,null,null,null,null,null,null,"",0,0]
[null,null,19,{"$f":"IF('AS1'!D23=\"\",\"\",'AS1'!D23)","v":""},{"$f":"IF('AS1'!E23=\"\",\"\",'AS1'!E23)","v":""},null,null,null,null,null,null,null,null,null,null,"",0,0]
[null,null,20,{"$f":"IF('AS1'!D24=\"\",\"\",'AS1'!D24)","v":""},{"$f":"IF('AS1'!E24=\"\",\"\",'AS1'!E24)","v":""},null,null,null,null,null,null,null,null,null,null,"",0,0]
[null,null,21,{"$f":"IF('AS1'!D25=\"\",\"\",'AS1'!D25)","v":""},{"$f":"IF('AS1'!E25=\"\",\"\",'AS1'!E25)","v":""},null,null,null,null,null,null,null,null,null,null,"",0,0]
[null,null,22,{"$f":"IF('AS1'!D26=\"\",\"\",'AS1'!D26)","v":""},{"$f":"IF('AS1'!E26=\"\",\"\",'AS1'!E26)","v":""},null,null,null,null,null,null,null,null,null,null,"",0,0]
[null,null,23,{"$f":"IF('AS1'!D27=\"\",\"\",'AS1'!D27)","v":""},{"$f":"IF('AS1'!E27=\"\",\"\",'AS1'!E27)","v":""},null,null,null,null,null,null,null,null,null,null,"",0,0]
[null,null,24,{"$f":"IF('AS1'!D28=\"\",\"\",'AS1'!D28)","v":""},{"$f":"IF('AS1'!E28=\"\",\"\",'AS1'!E28)","v":""},null,null,null,null,null,null,null,null,null,null,"",0,0]
[null,null,25,{"$f":"IF('AS1'!D29=\"\",\"\",'AS1'!D29)","v":""},{"$f":"IF('AS1'!E29=\"\",\"\",'AS1'!E29)","v":""},null,null,null,null,null,null,null,null,null,null,"",0,0]
[null,null,26,{"$f":"IF('AS1'!D30=\"\",\"\",'AS1'!D30)","v":""},{"$f":"IF('AS1'!E30=\"\",\"\",'AS1'!E30)","v":""},null,null,null,null,null,null,null,null,null,null,"",0,0]
[null,null,27,{"$f":"IF('AS1'!D31=\"\",\"\",'AS1'!D31)","v":""},{"$f":"IF('AS1'!E31=\"\",\"\",'AS1'!E31)","v":""},null,null,null,null,null,null,null,null,null,null,"",0,0]
[null,null,28,{"$f":"IF('AS1'!D32=\"\",\"\",'AS1'!D32)","v":""},{"$f":"IF('AS1'!E32=\"\",\"\",'AS1'!E32)","v":""},null,null,null,null,null,null,null,null,null,null,"",0,0]
[null,null,29,{"$f":"IF('AS1'!D33=\"\",\"\",'AS1'!D33)","v":""},{"$f":"IF('AS1'!E33=\"\",\"\",'AS1'!E33)","v":""},null,null,null,null,null,null,null,null,null,null,"",0,0]
[null,null,30,{"$f":"IF('AS1'!D34=\"\",\"\",'AS1'!D34)","v":""},{"$f":"IF('AS1'!E34=\"\",\"\",'AS1'!E34)","v":""},null,null,null,null,null,null,null,null,null,null,"",0,0]
[null,null,31,{"$f":"IF('AS1'!D35=\"\",\"\",'AS1'!D35)","v":""},{"$f":"IF('AS1'!E35=\"\",\"\",'AS1'!E35)","v":""},null,null,null,null,null,null,null,null,null,null,"",0,0]
[null,null,32,{"$f":"IF('AS1'!D36=\"\",\"\",'AS1'!D36)","v":""},{"$f":"IF('AS1'!E36=\"\",\"\",'AS1'!E36)","v":""},null,null,null,null,null,null,null,null,null,null,"",0,0]
[null,null,33,{"$f":"IF('AS1'!D37=\"\",\"\",'AS1'!D37)","v":""},{"$f":"IF('AS1'!E37=\"\",\"\",'AS1'!E37)","v":""},null,null,null,null,null,null,null,null,null,null,{"$f":"IF(COUNT(F38:O38)=0,\"\",SUM(F38:O38))","v":""},{"$f":"IF(COUNT(F38:O38)=0,0,ROUND(P38/COUNT(F38:O38),2))","v":0},0]
[null,null,34,{"$f":"IF('AS1'!D38=\"\",\"\",'AS1'!D38)","v":""},{"$f":"IF('AS1'!E38=\"\",\"\",'AS1'!E38)","v":""},null,null,null,null,null,null,null,null,null,null,"",0,0]
[null,null,35,{"$f":"IF('AS1'!D39=\"\",\"\",'AS1'!D39)","v":""},{"$f":"IF('AS1'!E39=\"\",\"\",'AS1'!E39)","v":""},null,null,null,null,null,null,null,null,null,null,"",0,0]
[null,null,36,{"$f":"IF('AS1'!D40=\"\",\"\",'AS1'!D40)","v":""},{"$f":"IF('AS1'!E40=\"\",\"\",'AS1'!E40)","v":""},null,null,null,null,null,null,null,null,null,null,"",0,0]
[null,null,37,{"$f":"IF('AS1'!D41=\"\",\"\",'AS1'!D41)","v":""},{"$f":"IF('AS1'!E41=\"\",\"\",'AS1'!E41)","v":""},null,null,null,null,null,null,null,null,null,null,"",0,0]
[null,null,38,{"$f":"IF('AS1'!D42=\"\",\"\",'AS1'!D42)","v":""},{"$f":"IF('AS1'!E42=\"\",\"\",'AS1'!E42)","v":""},null,null,null,null,null,null,null,null,null,null,"",0,0]
[null,null,39,{"$f":"IF('AS1'!D43=\"\",\"\",'AS1'!D43)","v":""},{"$f":"IF('AS1'!E43=\"\",\"\",'AS1'!E43)","v":""},null,null,null,null,null,null,null,null,null,null,"",0,0]
[null,null,40,{"$f":"IF('AS1'!D44=\"\",\"\",'AS1'!D44)","v":""},{"$f":"IF('AS1'!E44=\"\",\"\",'AS1'!E44)","v":""},null,null,null,null,null,null,null,null,null,null,"",0,0]
[null,null,41,{"$f":"IF('AS1'!D45=\"\",\"\",'AS1'!D45)","v":""},{"$f":"IF('AS1'!E45=\"\",\"\",'AS1'!E45)","v":""},null,null,null,null,null,null,null,null,null,null,"",0,0]
[null,null,42,{"$f":"IF('AS1'!D46=\"\",\"\",'AS1'!D46)","v":""},{"$f":"IF('AS1'!E46=\"\",\"\",'AS1'!E46)","v":""},null,null,null,null,null,null,null,null,null,null,"",0,0]
[null,null,43,{"$f":"IF('AS1'!D47=\"\",\"\",'AS1'!D47)","v":""},{"$f":"IF('AS1'!E47=\"\",\"\",'AS1'!E47)","v":""},null,null,null,null,null,null,null,null,null,null,"",0,0]
[null,null,44,{"$f":"IF('AS1'!D48=\"\",\"\",'AS1'!D48)","v":""},{"$f":"IF('AS1'!E48=\"\",\"\",'AS1'!E48)","v":""},null,null,null,null,null,null,null,null,null,null,"",0,0]
[null,null,45,{"$f":"IF('AS1'!D49=\"\",\"\",'AS1'!D49)","v":""},{"$f":"IF('AS1'!E49=\"\",\"\",'AS1'!E49)","v":""},null,null,null,null,null,null,null,null,null,null,"",0,0]
[null,null,46,{"$f":"IF('AS1'!D50=\"\",\"\",'AS1'!D50)","v":""},{"$f":"IF('AS1'!E50=\"\",\"\",'AS1'!E50)","v":""},null,null,null,null,null,null,null,null,null,null,"",0,0]
[null,null,47,{"$f":"IF('AS1'!D51=\"\",\"\",'AS1'!D51)","v":""},{"$f":"IF('AS1'!E51=\"\",\"\",'AS1'!E51)","v":""},null,null,null,null,null,null,null,null,null,null,"",0,0]
[null,null,48,{"$f":"IF('AS1'!D52=\"\",\"\",'AS1'!D52)","v":""},{"$f":"IF('AS1'!E52=\"\",\"\",'AS1'!E52)","v":""},null,null,null,null,null,null,null,null,null,null,"",0,0]
[null,null,49,{"$f":"IF('AS1'!D53=\"\",\"\",'AS1'!D53)","v":""},{"$f":"IF('AS1'!E53=\"\",\"\",'AS1'!E53)","v":""},null,null,null,null,null,null,null,null,null,null,"",0,0]
[null,null,50,{"$f":"IF('AS1'!D54=\"\",\"\",'AS1'!D54)","v":""},{"$f":"IF('AS1'!E54=\"\",\"\",'AS1'!E54)","v":""},null,null,null,null,null,null,null,null,null,null,"",0,0]
[null,null,51,{"$f":"IF('AS1'!D55=\"\",\"\",'AS1'!D55)","v":""},{"$f":"IF('AS1'!E55=\"\",\"\",'AS1'!E55)","v":""},null,null,null,null,null,null,null,null,null,null,"",0,0]
[null,null,52,{"$f":"IF('AS1'!D56=\"\",\"\",'AS1'!D56)","v":""},{"$f":"IF('AS1'!E56=\"\",\"\",'AS1'!E56)","v":""},null,null,null,null,null,null,null,null,null,null,"",0,0]
[null,null,53,{"$f":"IF('AS1'!D57=\"\",\"\",'AS1'!D57)","v":""},{"$f":"IF('AS1'!E57=\"\",\"\",'AS1'!E57)","v":""},null,null,null,null,null,null,null,null,null,null,"",0,0]
[null,null,54,{"$f":"IF('AS1'!D58=\"\",\"\",'AS1'!D58)","v":""},{"$f":"IF('AS1'!E58=\"\",\"\",'AS1'!E58)","v":""},null,null,null,null,null,null,null,null,null,null,"",0,0]
[null,null,55,{"$f":"IF('AS1'!D59=\"\",\"\",'AS1'!D59)","v":""},{"$f":"IF('AS1'!E59=\"\",\"\",'AS1'!E59)","v":""},null,null,null,null,null,null,null,null,null,null,"",0,0]
[null,null,56,{"$f":"IF('AS1'!D60=\"\",\"\",'AS1'!D60)","v":""},{"$f":"IF('AS1'!E60=\"\",\"\",'AS1'!E60)","v":""},null,null,null,null,null,null,null,null,null,null,"",0,0]
[null,null,57,{"$f":"IF('AS1'!D61=\"\",\"\",'AS1'!D61)","v":""},{"$f":"IF('AS1'!E61=\"\",\"\",'AS1'!E61)","v":""},null,null,null,null,null,null,null,null,null,null,"",0,0]
[null,null,58,{"$f":"IF('AS1'!D62=\"\",\"\",'AS1'!D62)","v":""},{"$f":"IF('AS1'!E62=\"\",\"\",'AS1'!E62)","v":""},null,null,null,null,null,null,null,null,null,null,"",0,0]
[null,null,59,{"$f":"IF('AS1'!D63=\"\",\"\",'AS1'!D63)","v":""},{"$f":"IF('AS1'!E63=\"\",\"\",'AS1'!E63)","v":""},null,null,null,null,null,null,null,null,null,null,"",0,0]
[null,null,60,{"$f":"IF('AS1'!D64=\"\",\"\",'AS1'!D64)","v":""},{"$f":"IF('AS1'!E64=\"\",\"\",'AS1'!E64)","v":""},null,null,null,null,null,null,null,null,null,null,"",0,0]
[null,null,61,{"$f":"IF('AS1'!D65=\"\",\"\",'AS1'!D65)","v":""},{"$f":"IF('AS1'!E65=\"\",\"\",'AS1'!E65)","v":""},null,null,null,null,null,null,null,null,null,null,"",0,0]
[null,null,62,{"$f":"IF('AS1'!D66=\"\",\"\",'AS1'!D66)","v":""},{"$f":"IF('AS1'!E66=\"\",\"\",'AS1'!E66)","v":""},null,null,null,null,null,null,null,null,null,null,"",0,0]
[null,null,63,{"$f":"IF('AS1'!D67=\"\",\"\",'AS1'!D67)","v":""},{"$f":"IF('AS1'!E67=\"\",\"\",'AS1'!E67)","v":""},null,null,null,null,null,null,null,null,null,null,"",0,0]
[null,null,64,{"$f":"IF('AS1'!D68=\"\",\"\",'AS1'!D68)","v":""},{"$f":"IF('AS1'!E68=\"\",\"\",'AS1'!E68)","v":""},null,null,null,null,null,null,null,null,null,null,"",0,0]
[null,null,65,{"$f":"IF('AS1'!D69=\"\",\"\",'AS1'!D69)","v":""},{"$f":"IF('AS1'!E69=\"\",\"\",'AS1'!E69)","v":""},null,null,null,null,null,null,null,null,null,null,{"$f":"IF(COUNT(F70:O70)=0,\"\",SUM(F70:O70))","v":""},{"$f":"IF(COUNT(F70:O70)=0,0,ROUND(P70/COUNT(F70:O70),2))","v":0},0]
[null,null,66,{"$f":"IF('AS1'!D70=\"\",\"\",'AS1'!D70)","v":""},{"$f":"IF('AS1'!E70=\"\",\"\",'AS1'!E70)","v":""},null,null,null,null,null,null,null,null,null,null,"",0,0]
[null,null,67,{"$f":"IF('AS1'!D71=\"\",\"\",'AS1'!D71)","v":""},{"$f":"IF('AS1'!E71=\"\",\"\",'AS1'!E71)","v":""},null,null,null,null,null,null,null,null,null,null,"",0,{"$f":"(Q72*3.5)/10","v":0}]
[null,null,68,{"$f":"IF('AS1'!D72=\"\",\"\",'AS1'!D72)","v":""},{"$f":"IF('AS1'!E72=\"\",\"\",'AS1'!E72)","v":""},null,null,null,null,null,null,null,null,null,null,"",0,0]
[null,null,69,{"$f":"IF('AS1'!D73=\"\",\"\",'AS1'!D73)","v":""},{"$f":"IF('AS1'!E73=\"\",\"\",'AS1'!E73)","v":""},null,null,null,null,null,null,null,null,null,null,"",0,0]
[null,null,70,{"$f":"IF('AS1'!D74=\"\",\"\",'AS1'!D74)","v":""},{"$f":"IF('AS1'!E74=\"\",\"\",'AS1'!E74)","v":""},null,null,null,null,null,null,null,null,null,null,"",0,0]

{"sheet":"AUT2","index":10,"n_rows":75,"n_cols":18,"rows_kept":75,"cut":false,"hidden":false,"merged":[[1,2,1,17],[2,2,2,17],[3,2,4,2],[3,3,4,3],[3,4,4,4],[3,15,4,15],[3,16,4,16],[3,17,4,17]]}
[]
[null,null,"ACTIVIDADES DE APRENDIZAJE AUTÓNOMO: Aprendizaje independiente e individual del estudiante - SEGUNDO PARCIAL"]
[null,null,"Lectura, análisis y compresión de materiales bibliográficos y documentales tanto analógicos como digitales, generación de datos y búsqueda de información, elaboración individual de  ensayos, trabajos y exposiciones."]
[null,null,"N","NRO DE CÉDULA","NOMINA",1,2,3,4,5,6,7,8,9,10,"suma","PROMEDIO sobre 10","EQUIVALENCIA sobre 3"]
[null,null,null,null,null,"Estudio de caso","Revisión bibliográfica correcciones","Inv. Formativa.Revisión bibliográfica "]
[null,null,1,{"$f":"IF('AS1'!D5=\"\",\"\",'AS1'!D5)","v":""},{"$f":"IF('AS1'!E5=\"\",\"\",'AS1'!E5)","v":"DAQUILEMA LONDO SHIRLEY ESTEFAFANÍA"},8.8000000000000007,6.2,9,null,null,null,null,null,null,null,{"$f":"IF(COUNT(F6:O6)=0,\"\",SUM(F6:O6))","v":24},{"$f":"IF(COUNT(F6:O6)=0,0,ROUND(P6/COUNT(F6:O6),2))","v":8},{"$f":"(Q6*3)/10","v":2.4}]
[null,null,2,{"$f":"IF('AS1'!D6=\"\",\"\",'AS1'!D6)","v":""},{"$f":"IF('AS1'!E6=\"\",\"\",'AS1'!E6)","v":"GOYES ORTIZ NATASHA DAYANA"},8.8000000000000007,9.5,9.5,null,null,null,null,null,null,null,27.8,9.27,{"$f":"(Q7*3)/10","v":2.7809999999999997}]
[null,null,3,{"$f":"IF('AS1'!D7=\"\",\"\",'AS1'!D7)","v":""},{"$f":"IF('AS1'!E7=\"\",\"\",'AS1'!E7)","v":"GUADALUPE RUIZ YULISA NATALY"},8.8000000000000007,4.3,9,null,null,null,null,null,null,null,22.1,7.37,{"$f":"(Q8*3)/10","v":2.2109999999999999}]
[null,null,4,{"$f":"IF('AS1'!D8=\"\",\"\",'AS1'!D8)","v":""},{"$f":"IF('AS1'!E8=\"\",\"\",'AS1'!E8)","v":"MELO CHAVEZ KEVIN JOSUE"},8.8000000000000007,null,null,null,null,null,null,null,null,null,8.8000000000000007,8.8000000000000007,{"$f":"(Q9*3)/10","v":2.64}]
[null,null,5,{"$f":"IF('AS1'!D9=\"\",\"\",'AS1'!D9)","v":""},{"$f":"IF('AS1'!E9=\"\",\"\",'AS1'!E9)","v":"MULLO PAUCAR ADRIANA ANABEL"},7,8,9,null,null,null,null,null,null,null,24,8,2.4]
[null,null,6,{"$f":"IF('AS1'!D10=\"\",\"\",'AS1'!D10)","v":""},{"$f":"IF('AS1'!E10=\"\",\"\",'AS1'!E10)","v":"NARANJO PALACIOS FERNANDA BRIGUITTE"},null,null,null,null,null,null,null,null,null,null,"",0,0]
[null,null,7,{"$f":"IF('AS1'!D11=\"\",\"\",'AS1'!D11)","v":""},{"$f":"IF('AS1'!E11=\"\",\"\",'AS1'!E11)","v":"SOTO VARGAS ERIKA SAMANTA"},7,8.4,9,null,null,null,null,null,null,null,24.4,8.1300000000000008,2.4390000000000001]
[null,null,8,{"$f":"IF('AS1'!D12=\"\",\"\",'AS1'!D12)","v":""},{"$f":"IF('AS1'!E12=\"\",\"\",'AS1'!E12)","v":"VALLEJO ORDOÑEZ SAYONARA ELIZABETH"},7,4.9000000000000004,8,null,null,null,null,null,null,null,19.899999999999999,6.63,1.9890000000000001]
[null,null,9,{"$f":"IF('AS1'!D13=\"\",\"\",'AS1'!D13)","v":""},{"$f":"IF('AS1'!E13=\"\",\"\",'AS1'!E13)","v":""},null,null,null,null,null,null,null,null,null,null,"",0,0]
[null,null,10,{"$f":"IF('AS1'!D14=\"\",\"\",'AS1'!D14)","v":""},{"$f":"IF('AS1'!E14=\"\",\"\",'AS1'!E14)","v":""},null,null,null,null,null,null,null,null,null,null,"",0,0]
[null,null,11,{"$f":"IF('AS1'!D15=\"\",\"\",'AS1'!D15)","v":""},{"$f":"IF('AS1'!E15=\"\",\"\",'AS1'!E15)","v":""},null,null,null,null,null,null,null,null,null,null,"",0,0]
[null,null,12,{"$f":"IF('AS1'!D16=\"\",\"\",'AS1'!D16)","v":""},{"$f":"IF('AS1'!E16=\"\",\"\",'AS1'!E16)","v":""},null,null,null,null,null,null,null,null,null,null,"",0,0]
[null,null,13,{"$f":"IF('AS1'!D17=\"\",\"\",'AS1'!D17)","v":""},{"$f":"IF('AS1'!E17=\"\",\"\",'AS1'!E17)","v":""},null,null,null,null,null,null,null,null,null,null,"",0,0]
[null,null,14,{"$f":"IF('AS1'!D18=\"\",\"\",'AS1'!D18)","v":""},{"$f":"IF('AS1'!E18=\"\",\"\",'AS1'!E18)","v":""},null,null,null,null,null,null,null,null,null,null,"",0,0]
[null,null,15,{"$f":"IF('AS1'!D19=\"\",\"\",'AS1'!D19)","v":""},{"$f":"IF('AS1'!E19=\"\",\"\",'AS1'!E19)","v":""},null,null,null,null,null,null,null,null,null,null,"",0,0]
[null,null,16,{"$f":"IF('AS1'!D20=\"\",\"\",'AS1'!D20)","v":""},{"$f":"IF('AS1'!E20=\"\",\"\",'AS1'!E20)","v":""},null,null,null,null,null,null,null,null,null,null,"",0,0]
[null,null,17,{"$f":"IF('AS1'!D21=\"\",\"\",'AS1'!D21)","v":""},{"$f":"IF('AS1'!E21=\"\",\"\",'AS1'!E21)","v":""},null,null,null,null,null,null,null,null,null,null,"",0,0]
[null,null,18,{"$f":"IF('AS1'!D22=\"\",\"\",'AS1'!D22)","v":""},{"$f":"IF('AS1'!E22=\"\",\"\",'AS1'!E22)","v":""},null,null,null,null,null,null,null,null,null,null,"",0,0]
[null,null,19,{"$f":"IF('AS1'!D23=\"\",\"\",'AS1'!D23)","v":""},{"$f":"IF('AS1'!E23=\"\",\"\",'AS1'!E23)","v":""},null,null,null,null,null,null,null,null,null,null,"",0,0]
[null,null,20,{"$f":"IF('AS1'!D24=\"\",\"\",'AS1'!D24)","v":""},{"$f":"IF('AS1'!E24=\"\",\"\",'AS1'!E24)","v":""},null,null,null,null,null,null,null,null,null,null,"",0,0]
[null,null,21,{"$f":"IF('AS1'!D25=\"\",\"\",'AS1'!D25)","v":""},{"$f":"IF('AS1'!E25=\"\",\"\",'AS1'!E25)","v":""},null,null,null,null,null,null,null,null,null,null,"",0,0]
[null,null,22,{"$f":"IF('AS1'!D26=\"\",\"\",'AS1'!D26)","v":""},{"$f":"IF('AS1'!E26=\"\",\"\",'AS1'!E26)","v":""},null,null,null,null,null,null,null,null,null,null,"",0,0]
[null,null,23,{"$f":"IF('AS1'!D27=\"\",\"\",'AS1'!D27)","v":""},{"$f":"IF('AS1'!E27=\"\",\"\",'AS1'!E27)","v":""},null,null,null,null,null,null,null,null,null,null,"",0,0]
[null,null,24,{"$f":"IF('AS1'!D28=\"\",\"\",'AS1'!D28)","v":""},{"$f":"IF('AS1'!E28=\"\",\"\",'AS1'!E28)","v":""},null,null,null,null,null,null,null,null,null,null,"",0,0]
[null,null,25,{"$f":"IF('AS1'!D29=\"\",\"\",'AS1'!D29)","v":""},{"$f":"IF('AS1'!E29=\"\",\"\",'AS1'!E29)","v":""},null,null,null,null,null,null,null,null,null,null,"",0,0]
[null,null,26,{"$f":"IF('AS1'!D30=\"\",\"\",'AS1'!D30)","v":""},{"$f":"IF('AS1'!E30=\"\",\"\",'AS1'!E30)","v":""},null,null,null,null,null,null,null,null,null,null,"",0,0]
[null,null,27,{"$f":"IF('AS1'!D31=\"\",\"\",'AS1'!D31)","v":""},{"$f":"IF('AS1'!E31=\"\",\"\",'AS1'!E31)","v":""},null,null,null,null,null,null,null,null,null,null,"",0,0]
[null,null,28,{"$f":"IF('AS1'!D32=\"\",\"\",'AS1'!D32)","v":""},{"$f":"IF('AS1'!E32=\"\",\"\",'AS1'!E32)","v":""},null,null,null,null,null,null,null,null,null,null,"",0,0]
[null,null,29,{"$f":"IF('AS1'!D33=\"\",\"\",'AS1'!D33)","v":""},{"$f":"IF('AS1'!E33=\"\",\"\",'AS1'!E33)","v":""},null,null,null,null,null,null,null,null,null,null,"",0,0]
[null,null,30,{"$f":"IF('AS1'!D34=\"\",\"\",'AS1'!D34)","v":""},{"$f":"IF('AS1'!E34=\"\",\"\",'AS1'!E34)","v":""},null,null,null,null,null,null,null,null,null,null,"",0,0]
[null,null,31,{"$f":"IF('AS1'!D35=\"\",\"\",'AS1'!D35)","v":""},{"$f":"IF('AS1'!E35=\"\",\"\",'AS1'!E35)","v":""},null,null,null,null,null,null,null,null,null,null,"",0,0]
[null,null,32,{"$f":"IF('AS1'!D36=\"\",\"\",'AS1'!D36)","v":""},{"$f":"IF('AS1'!E36=\"\",\"\",'AS1'!E36)","v":""},null,null,null,null,null,null,null,null,null,null,"",0,0]
[null,null,33,{"$f":"IF('AS1'!D37=\"\",\"\",'AS1'!D37)","v":""},{"$f":"IF('AS1'!E37=\"\",\"\",'AS1'!E37)","v":""},null,null,null,null,null,null,null,null,null,null,{"$f":"IF(COUNT(F38:O38)=0,\"\",SUM(F38:O38))","v":""},{"$f":"IF(COUNT(F38:O38)=0,0,ROUND(P38/COUNT(F38:O38),2))","v":0},0]
[null,null,34,{"$f":"IF('AS1'!D38=\"\",\"\",'AS1'!D38)","v":""},{"$f":"IF('AS1'!E38=\"\",\"\",'AS1'!E38)","v":""},null,null,null,null,null,null,null,null,null,null,"",0,0]
[null,null,35,{"$f":"IF('AS1'!D39=\"\",\"\",'AS1'!D39)","v":""},{"$f":"IF('AS1'!E39=\"\",\"\",'AS1'!E39)","v":""},null,null,null,null,null,null,null,null,null,null,"",0,0]
[null,null,36,{"$f":"IF('AS1'!D40=\"\",\"\",'AS1'!D40)","v":""},{"$f":"IF('AS1'!E40=\"\",\"\",'AS1'!E40)","v":""},null,null,null,null,null,null,null,null,null,null,"",0,0]
[null,null,37,{"$f":"IF('AS1'!D41=\"\",\"\",'AS1'!D41)","v":""},{"$f":"IF('AS1'!E41=\"\",\"\",'AS1'!E41)","v":""},null,null,null,null,null,null,null,null,null,null,"",0,0]
[null,null,38,{"$f":"IF('AS1'!D42=\"\",\"\",'AS1'!D42)","v":""},{"$f":"IF('AS1'!E42=\"\",\"\",'AS1'!E42)","v":""},null,null,null,null,null,null,null,null,null,null,"",0,0]
[null,null,39,{"$f":"IF('AS1'!D43=\"\",\"\",'AS1'!D43)","v":""},{"$f":"IF('AS1'!E43=\"\",\"\",'AS1'!E43)","v":""},null,null,null,null,null,null,null,null,null,null,"",0,0]
[null,null,40,{"$f":"IF('AS1'!D44=\"\",\"\",'AS1'!D44)","v":""},{"$f":"IF('AS1'!E44=\"\",\"\",'AS1'!E44)","v":""},null,null,null,null,null,null,null,null,null,null,"",0,0]
[null,null,41,{"$f":"IF('AS1'!D45=\"\",\"\",'AS1'!D45)","v":""},{"$f":"IF('AS1'!E45=\"\",\"\",'AS1'!E45)","v":""},null,null,null,null,null,null,null,null,null,null,"",0,0]
[null,null,42,{"$f":"IF('AS1'!D46=\"\",\"\",'AS1'!D46)","v":""},{"$f":"IF('AS1'!E46=\"\",\"\",'AS1'!E46)","v":""},null,null,null,null,null,null,null,null,null,null,"",0,0]
[null,null,43,{"$f":"IF('AS1'!D47=\"\",\"\",'AS1'!D47)","v":""},{"$f":"IF('AS1'!E47=\"\",\"\",'AS1'!E47)","v":""},null,null,null,null,null,null,null,null,null,null,"",0,0]
[null,null,44,{"$f":"IF('AS1'!D48=\"\",\"\",'AS1'!D48)","v":""},{"$f":"IF('AS1'!E48=\"\",\"\",'AS1'!E48)","v":""},null,null,null,null,null,null,null,null,null,null,"",0,0]
[null,null,45,{"$f":"IF('AS1'!D49=\"\",\"\",'AS1'!D49)","v":""},{"$f":"IF('AS1'!E49=\"\",\"\",'AS1'!E49)","v":""},null,null,null,null,null,null,null,null,null,null,"",0,0]
[null,null,46,{"$f":"IF('AS1'!D50=\"\",\"\",'AS1'!D50)","v":""},{"$f":"IF('AS1'!E50=\"\",\"\",'AS1'!E50)","v":""},null,null,null,null,null,null,null,null,null,null,"",0,0]
[null,null,47,{"$f":"IF('AS1'!D51=\"\",\"\",'AS1'!D51)","v":""},{"$f":"IF('AS1'!E51=\"\",\"\",'AS1'!E51)","v":""},null,null,null,null,null,null,null,null,null,null,"",0,0]
[null,null,48,{"$f":"IF('AS1'!D52=\"\",\"\",'AS1'!D52)","v":""},{"$f":"IF('AS1'!E52=\"\",\"\",'AS1'!E52)","v":""},null,null,null,null,null,null,null,null,null,null,"",0,0]
[null,null,49,{"$f":"IF('AS1'!D53=\"\",\"\",'AS1'!D53)","v":""},{"$f":"IF('AS1'!E53=\"\",\"\",'AS1'!E53)","v":""},null,null,null,null,null,null,null,null,null,null,"",0,0]
[null,null,50,{"$f":"IF('AS1'!D54=\"\",\"\",'AS1'!D54)","v":""},{"$f":"IF('AS1'!E54=\"\",\"\",'AS1'!E54)","v":""},null,null,null,null,null,null,null,null,null,null,"",0,0]
[null,null,51,{"$f":"IF('AS1'!D55=\"\",\"\",'AS1'!D55)","v":""},{"$f":"IF('AS1'!E55=\"\",\"\",'AS1'!E55)","v":""},null,null,null,null,null,null,null,null,null,null,"",0,0]
[null,null,52,{"$f":"IF('AS1'!D56=\"\",\"\",'AS1'!D56)","v":""},{"$f":"IF('AS1'!E56=\"\",\"\",'AS1'!E56)","v":""},null,null,null,null,null,null,null,null,null,null,"",0,0]
[null,null,53,{"$f":"IF('AS1'!D57=\"\",\"\",'AS1'!D57)","v":""},{"$f":"IF('AS1'!E57=\"\",\"\",'AS1'!E57)","v":""},null,null,null,null,null,null,null,null,null,null,"",0,0]
[null,null,54,{"$f":"IF('AS1'!D58=\"\",\"\",'AS1'!D58)","v":""},{"$f":"IF('AS1'!E58=\"\",\"\",'AS1'!E58)","v":""},null,null,null,null,null,null,null,null,null,null,"",0,0]
[null,null,55,{"$f":"IF('AS1'!D59=\"\",\"\",'AS1'!D59)","v":""},{"$f":"IF('AS1'!E59=\"\",\"\",'AS1'!E59)","v":""},null,null,null,null,null,null,null,null,null,null,"",0,0]
[null,null,56,{"$f":"IF('AS1'!D60=\"\",\"\",'AS1'!D60)","v":""},{"$f":"IF('AS1'!E60=\"\",\"\",'AS1'!E60)","v":""},null,null,null,null,null,null,null,null,null,null,"",0,0]
[null,null,57,{"$f":"IF('AS1'!D61=\"\",\"\",'AS1'!D61)","v":""},{"$f":"IF('AS1'!E61=\"\",\"\",'AS1'!E61)","v":""},null,null,null,null,null,null,null,null,null,null,"",0,0]
[null,null,58,{"$f":"IF('AS1'!D62=\"\",\"\",'AS1'!D62)","v":""},{"$f":"IF('AS1'!E62=\"\",\"\",'AS1'!E62)","v":""},null,null,null,null,null,null,null,null,null,null,"",0,0]
[null,null,59,{"$f":"IF('AS1'!D63=\"\",\"\",'AS1'!D63)","v":""},{"$f":"IF('AS1'!E63=\"\",\"\",'AS1'!E63)","v":""},null,null,null,null,null,null,null,null,null,null,"",0,0]
[null,null,60,{"$f":"IF('AS1'!D64=\"\",\"\",'AS1'!D64)","v":""},{"$f":"IF('AS1'!E64=\"\",\"\",'AS1'!E64)","v":""},null,null,null,null,null,null,null,null,null,null,"",0,0]
[null,null,61,{"$f":"IF('AS1'!D65=\"\",\"\",'AS1'!D65)","v":""},{"$f":"IF('AS1'!E65=\"\",\"\",'AS1'!E65)","v":""},null,null,null,null,null,null,null,null,null,null,"",0,0]
[null,null,62,{"$f":"IF('AS1'!D66=\"\",\"\",'AS1'!D66)","v":""},{"$f":"IF('AS1'!E66=\"\",\"\",'AS1'!E66)","v":""},null,null,null,null,null,null,null,null,null,null,"",0,0]
[null,null,63,{"$f":"IF('AS1'!D67=\"\",\"\",'AS1'!D67)","v":""},{"$f":"IF('AS1'!E67=\"\",\"\",'AS1'!E67)","v":""},null,null,null,null,null,null,null,null,null,null,"",0,0]
[null,null,64,{"$f":"IF('AS1'!D68=\"\",\"\",'AS1'!D68)","v":""},{"$f":"IF('AS1'!E68=\"\",\"\",'AS1'!E68)","v":""},null,null,null,null,null,null,null,null,null,null,"",0,0]
[null,null,65,{"$f":"IF('AS1'!D69=\"\",\"\",'AS1'!D69)","v":""},{"$f":"IF('AS1'!E69=\"\",\"\",'AS1'!E69)","v":""},null,null,null,null,null,null,null,null,null,null,{"$f":"IF(COUNT(F70:O70)=0,\"\",SUM(F70:O70))","v":""},{"$f":"IF(COUNT(F70:O70)=0,0,ROUND(P70/COUNT(F70:O70),2))","v":0},0]
[null,null,66,{"$f":"IF('AS1'!D70=\"\",\"\",'AS1'!D70)","v":""},{"$f":"IF('AS1'!E70=\"\",\"\",'AS1'!E70)","v":""},null,null,null,null,null,null,null,null,null,null,"",0,0]
[null,null,67,{"$f":"IF('AS1'!D71=\"\",\"\",'AS1'!D71)","v":""},{"$f":"IF('AS1'!E71=\"\",\"\",'AS1'!E71)","v":""},null,null,null,null,null,null,null,null,null,null,"",0,0]
[null,null,68,{"$f":"IF('AS1'!D72=\"\",\"\",'AS1'!D72)","v":""},{"$f":"IF('AS1'!E72=\"\",\"\",'AS1'!E72)","v":""},null,null,null,null,null,null,null,null,null,null,"",0,{"$f":"(Q73*3)/10","v":0}]
[null,null,69,{"$f":"IF('AS1'!D73=\"\",\"\",'AS1'!D73)","v":""},{"$f":"IF('AS1'!E73=\"\",\"\",'AS1'!E73)","v":""},null,null,null,null,null,null,null,null,null,null,"",0,0]
[null,null,70,{"$f":"IF('AS1'!D74=\"\",\"\",'AS1'!D74)","v":""},{"$f":"IF('AS1'!E74=\"\",\"\",'AS1'!E74)","v":""},null,null,null,null,null,null,null,null,null,null,"",0,{"$f":"(Q75*3)/10","v":0}]

{"sheet":"PARCIAL2","index":11,"n_rows":82,"n_cols":12,"rows_kept":82,"cut":false,"hidden":false,"merged":[[1,2,1,11],[2,2,2,11],[3,2,3,11],[4,2,4,11],[5,2,5,8],[5,9,5,11],[6,2,6,8],[6,9,6,11],[7,2,7,5],[7,8,7,10],[8,2,8,11],[9,2,9,4],[9,5,9,6],[9,7,9,9],[9,10,9,11],[10,2,11,2],[10,11,11,11],[10,3,11,3],[10,4,11,4],[10,5,11,5],[10,6,11,6],[10,10,11,10]]}
[]
[null,null,"UNIVERSIDAD NACIONAL DE CHIMBORAZO"]
[null,null,{"$f":"CONCATENATE(\"FACULTAD DE \",INICIO!D5)","v":"FACULTAD DE Ciencias de la Salud"}]
[null,null,{"$f":"CONCATENATE(\"CARRERA DE \",INICIO!D6)","v":"CARRERA DE Enfermería"}]
[null,null,"ACTA DE CALIFICACIONES DEL SEGUNDO PARCIAL"]
[null,null,{"$f":"CONCATENATE(\"SEMESTRE: \",INICIO!D8)","v":"SEMESTRE: 6to"},null,null,null,null,null,null,{"$f":"CONCATENATE(\"ASIGNATURA: \",INICIO!D11)","v":"ASIGNATURA: Enfermería Gíneco oObstétrica II"}]
[null,null,{"$f":"CONCATENATE(\"PARALELO: \",INICIO!D9)","v":"PARALELO: A"},null,null,null,null,null,null,{"$f":"CONCATENATE(\"DOCENTE: \",INICIO!D4)","v":"DOCENTE: Graciela Rivera Herrera"}]
[null,null,{"$f":"CONCATENATE(\"PERIODO LECTIVO: \",INICIO!D7)","v":"PERIODO LECTIVO:  2024 -  2025"},null,null,null,null,null,"No. Horas Totales Laboradas:",null,null,{"$f":"'AS2'!BF2","v":54}]
[]
[null,null,null,null,null,"ASISTENCIA",null,"CALIFICACIONES",null,null,"PROMEDIO"]
[null,null,"N","NRO DE CÉDULA","NOMINA","N","%","Aprendizaje\n en contacto\n con el\n docente","Aprendizaje \npráctico experimental","Actividades de Aprendizaje Autónomo","Números","Letras"]
[null,null,null,null,null,null,null,"3,5 PUNTOS","3,5 PUNTOS","3 PUNTOS"]
[null,null,1,{"$f":"IF('AS1'!D5=\"\",\"\",'AS1'!D5)","v":""},{"$f":"IF('AS1'!E5=\"\",\"\",'AS1'!E5)","v":"DAQUILEMA LONDO SHIRLEY ESTEFAFANÍA"},{"$f":"'AS2'!BF5","v":54},{"$f":"IF(L$8=0,0,(F13*100)/L$8)","v":100},{"$f":"'DOC2'!R6","v":2.4079999999999999},{"$f":"PRAC2!R6","v":2.6775000000000002},{"$f":"'AUT2'!R6","v":2.4},{"$f":"SUM(H13:J13)","v":7.4855},{"$f":"VLOOKUP(K13,RESERVADO!A$1:B$1001,2)","v":"SIETE.CUARENTAYOCHO"}]
[null,null,2,{"$f":"IF('AS1'!D6=\"\",\"\",'AS1'!D6)","v":""},{"$f":"IF('AS1'!E6=\"\",\"\",'AS1'!E6)","v":"GOYES ORTIZ NATASHA DAYANA"},{"$f":"'AS2'!BF6","v":54},{"$f":"IF(L$8=0,0,(F14*100)/L$8)","v":100},{"$f":"'DOC2'!R7","v":2.5655000000000001},{"$f":"PRAC2!R7","v":2.9330000000000003},{"$f":"'AUT2'!R7","v":2.7809999999999997},{"$f":"SUM(H14:J14)","v":8.2794999999999987},{"$f":"VLOOKUP(K14,RESERVADO!A$1:B$1001,2)","v":"OCHO.VEINTEYSIETE"}]
[null,null,3,{"$f":"IF('AS1'!D7=\"\",\"\",'AS1'!D7)","v":""},{"$f":"IF('AS1'!E7=\"\",\"\",'AS1'!E7)","v":"GUADALUPE RUIZ YULISA NATALY"},{"$f":"'AS2'!BF7","v":54},{"$f":"IF(L$8=0,0,(F15*100)/L$8)","v":100},{"$f":"'DOC2'!R8","v":2.3834999999999997},{"$f":"PRAC2!R8","v":2.3275000000000001},{"$f":"'AUT2'!R8","v":2.2109999999999999},6.9220000000000006,{"$f":"VLOOKUP(K15,RESERVADO!A$1:B$1001,2)","v":"SEIS.NOVENTAYDOS"}]
[null,null,4,{"$f":"IF('AS1'!D8=\"\",\"\",'AS1'!D8)","v":""},{"$f":"IF('AS1'!E8=\"\",\"\",'AS1'!E8)","v":"MELO CHAVEZ KEVIN JOSUE"},{"$f":"'AS2'!BF8","v":50},{"$f":"IF(L$8=0,0,(F16*100)/L$8)","v":92.592592592592595},{"$f":"'DOC2'!R9","v":2.3765000000000001},{"$f":"PRAC2!R9","v":2.5409999999999999},{"$f":"'AUT2'!R9","v":2.64},7.557500000000001,{"$f":"VLOOKUP(K16,RESERVADO!A$1:B$1001,2)","v":"SIETE.CINCUENTAYCINCO"}]
[null,null,5,{"$f":"IF('AS1'!D9=\"\",\"\",'AS1'!D9)","v":""},{"$f":"IF('AS1'!E9=\"\",\"\",'AS1'!E9)","v":"MULLO PAUCAR ADRIANA ANABEL"},{"$f":"'AS2'!BF9","v":52},96.296296296296291,{"$f":"'DOC2'!R10","v":2.5655000000000001},{"$f":"PRAC2!R10","v":2.5829999999999997},{"$f":"'AUT2'!R10","v":2.4},{"$f":"SUM(H17:J17)","v":7.5485000000000007},{"$f":"VLOOKUP(K17,RESERVADO!A$1:B$1001,2)","v":"SIETE.CINCUENTAYCUATRO"}]
[null,null,6,{"$f":"IF('AS1'!D10=\"\",\"\",'AS1'!D10)","v":""},{"$f":"IF('AS1'!E10=\"\",\"\",'AS1'!E10)","v":"NARANJO PALACIOS FERNANDA BRIGUITTE"},{"$f":"'AS2'!BF10","v":0},0,{"$f":"'DOC2'!R11","v":0},{"$f":"PRAC2!R11","v":0},{"$f":"'AUT2'!R11","v":0},0,{"$f":"VLOOKUP(K18,RESERVADO!A$1:B$1001,2)","v":"CERO"}]
[null,null,7,{"$f":"IF('AS1'!D11=\"\",\"\",'AS1'!D11)","v":""},{"$f":"IF('AS1'!E11=\"\",\"\",'AS1'!E11)","v":"SOTO VARGAS ERIKA SAMANTA"},{"$f":"'AS2'!BF11","v":54},100,{"$f":"'DOC2'!R12","v":2.5550000000000002},{"$f":"PRAC2!R12","v":2.6775000000000002},{"$f":"'AUT2'!R12","v":2.4390000000000001},7.6715,{"$f":"VLOOKUP(K19,RESERVADO!A$1:B$1001,2)","v":"SIETE.SESENTAYSIETE"}]
[null,null,8,{"$f":"IF('AS1'!D12=\"\",\"\",'AS1'!D12)","v":""},{"$f":"IF('AS1'!E12=\"\",\"\",'AS1'!E12)","v":"VALLEJO ORDOÑEZ SAYONARA ELIZABETH"},{"$f":"'AS2'!BF12","v":52},96.296296296296291,{"$f":"'DOC2'!R13","v":1.722},{"$f":"PRAC2!R13","v":2.3029999999999999},{"$f":"'AUT2'!R13","v":1.9890000000000001},6.0140000000000002,{"$f":"VLOOKUP(K20,RESERVADO!A$1:B$1001,2)","v":"SEIS.CERO UNO"}]
[null,null,9,{"$f":"IF('AS1'!D13=\"\",\"\",'AS1'!D13)","v":""},{"$f":"IF('AS1'!E13=\"\",\"\",'AS1'!E13)","v":""},{"$f":"'AS2'!BF13","v":0},0,{"$f":"'DOC2'!R14","v":0},{"$f":"PRAC2!R14","v":0},{"$f":"'AUT2'!R14","v":0},0,{"$f":"VLOOKUP(K21,RESERVADO!A$1:B$1001,2)","v":"CERO"}]
[null,null,10,{"$f":"IF('AS1'!D14=\"\",\"\",'AS1'!D14)","v":""},{"$f":"IF('AS1'!E14=\"\",\"\",'AS1'!E14)","v":""},{"$f":"'AS2'!BF14","v":0},0,{"$f":"'DOC2'!R15","v":0},{"$f":"PRAC2!R15","v":0},{"$f":"'AUT2'!R15","v":0},0,{"$f":"VLOOKUP(K22,RESERVADO!A$1:B$1001,2)","v":"CERO"}]
[null,null,11,{"$f":"IF('AS1'!D15=\"\",\"\",'AS1'!D15)","v":""},{"$f":"IF('AS1'!E15=\"\",\"\",'AS1'!E15)","v":""},{"$f":"'AS2'!BF15","v":0},0,{"$f":"'DOC2'!R16","v":0},{"$f":"PRAC2!R16","v":0},{"$f":"'AUT2'!R16","v":0},0,{"$f":"VLOOKUP(K23,RESERVADO!A$1:B$1001,2)","v":"CERO"}]
[null,null,12,{"$f":"IF('AS1'!D16=\"\",\"\",'AS1'!D16)","v":""},{"$f":"IF('AS1'!E16=\"\",\"\",'AS1'!E16)","v":""},{"$f":"'AS2'!BF16","v":0},0,{"$f":"'DOC2'!R17","v":0},{"$f":"PRAC2!R17","v":0},{"$f":"'AUT2'!R17","v":0},0,{"$f":"VLOOKUP(K24,RESERVADO!A$1:B$1001,2)","v":"CERO"}]
[null,null,13,{"$f":"IF('AS1'!D17=\"\",\"\",'AS1'!D17)","v":""},{"$f":"IF('AS1'!E17=\"\",\"\",'AS1'!E17)","v":""},{"$f":"'AS2'!BF17","v":0},0,{"$f":"'DOC2'!R18","v":0},{"$f":"PRAC2!R18","v":0},{"$f":"'AUT2'!R18","v":0},0,{"$f":"VLOOKUP(K25,RESERVADO!A$1:B$1001,2)","v":"CERO"}]
[null,null,14,{"$f":"IF('AS1'!D18=\"\",\"\",'AS1'!D18)","v":""},{"$f":"IF('AS1'!E18=\"\",\"\",'AS1'!E18)","v":""},{"$f":"'AS2'!BF18","v":0},0,{"$f":"'DOC2'!R19","v":0},{"$f":"PRAC2!R19","v":0},{"$f":"'AUT2'!R19","v":0},0,{"$f":"VLOOKUP(K26,RESERVADO!A$1:B$1001,2)","v":"CERO"}]
[null,null,15,{"$f":"IF('AS1'!D19=\"\",\"\",'AS1'!D19)","v":""},{"$f":"IF('AS1'!E19=\"\",\"\",'AS1'!E19)","v":""},{"$f":"'AS2'!BF19","v":0},0,{"$f":"'DOC2'!R20","v":0},{"$f":"PRAC2!R20","v":0},{"$f":"'AUT2'!R20","v":0},0,{"$f":"VLOOKUP(K27,RESERVADO!A$1:B$1001,2)","v":"CERO"}]
[null,null,16,{"$f":"IF('AS1'!D20=\"\",\"\",'AS1'!D20)","v":""},{"$f":"IF('AS1'!E20=\"\",\"\",'AS1'!E20)","v":""},{"$f":"'AS2'!BF20","v":0},0,{"$f":"'DOC2'!R21","v":0},{"$f":"PRAC2!R21","v":0},{"$f":"'AUT2'!R21","v":0},0,{"$f":"VLOOKUP(K28,RESERVADO!A$1:B$1001,2)","v":"CERO"}]
[null,null,17,{"$f":"IF('AS1'!D21=\"\",\"\",'AS1'!D21)","v":""},{"$f":"IF('AS1'!E21=\"\",\"\",'AS1'!E21)","v":""},{"$f":"'AS2'!BF21","v":0},0,{"$f":"'DOC2'!R22","v":0},{"$f":"PRAC2!R22","v":0},{"$f":"'AUT2'!R22","v":0},0,{"$f":"VLOOKUP(K29,RESERVADO!A$1:B$1001,2)","v":"CERO"}]
[null,null,18,{"$f":"IF('AS1'!D22=\"\",\"\",'AS1'!D22)","v":""},{"$f":"IF('AS1'!E22=\"\",\"\",'AS1'!E22)","v":""},{"$f":"'AS2'!BF22","v":0},0,{"$f":"'DOC2'!R23","v":0},{"$f":"PRAC2!R23","v":0},{"$f":"'AUT2'!R23","v":0},0,{"$f":"VLOOKUP(K30,RESERVADO!A$1:B$1001,2)","v":"CERO"}]
[null,null,19,{"$f":"IF('AS1'!D23=\"\",\"\",'AS1'!D23)","v":""},{"$f":"IF('AS1'!E23=\"\",\"\",'AS1'!E23)","v":""},{"$f":"'AS2'!BF23","v":0},0,{"$f":"'DOC2'!R24","v":0},{"$f":"PRAC2!R24","v":0},{"$f":"'AUT2'!R24","v":0},0,{"$f":"VLOOKUP(K31,RESERVADO!A$1:B$1001,2)","v":"CERO"}]
[null,null,20,{"$f":"IF('AS1'!D24=\"\",\"\",'AS1'!D24)","v":""},{"$f":"IF('AS1'!E24=\"\",\"\",'AS1'!E24)","v":""},{"$f":"'AS2'!BF24","v":0},0,{"$f":"'DOC2'!R25","v":0},{"$f":"PRAC2!R25","v":0},{"$f":"'AUT2'!R25","v":0},0,{"$f":"VLOOKUP(K32,RESERVADO!A$1:B$1001,2)","v":"CERO"}]
[null,null,21,{"$f":"IF('AS1'!D25=\"\",\"\",'AS1'!D25)","v":""},{"$f":"IF('AS1'!E25=\"\",\"\",'AS1'!E25)","v":""},{"$f":"'AS2'!BF25","v":0},0,{"$f":"'DOC2'!R26","v":0},{"$f":"PRAC2!R26","v":0},{"$f":"'AUT2'!R26","v":0},0,{"$f":"VLOOKUP(K33,RESERVADO!A$1:B$1001,2)","v":"CERO"}]
[null,null,22,{"$f":"IF('AS1'!D26=\"\",\"\",'AS1'!D26)","v":""},{"$f":"IF('AS1'!E26=\"\",\"\",'AS1'!E26)","v":""},{"$f":"'AS2'!BF26","v":0},0,{"$f":"'DOC2'!R27","v":0},{"$f":"PRAC2!R27","v":0},{"$f":"'AUT2'!R27","v":0},0,{"$f":"VLOOKUP(K34,RESERVADO!A$1:B$1001,2)","v":"CERO"}]
[null,null,23,{"$f":"IF('AS1'!D27=\"\",\"\",'AS1'!D27)","v":""},{"$f":"IF('AS1'!E27=\"\",\"\",'AS1'!E27)","v":""},{"$f":"'AS2'!BF27","v":0},0,{"$f":"'DOC2'!R28","v":0},{"$f":"PRAC2!R28","v":0},{"$f":"'AUT2'!R28","v":0},0,{"$f":"VLOOKUP(K35,RESERVADO!A$1:B$1001,2)","v":"CERO"}]
[null,null,24,{"$f":"IF('AS1'!D28=\"\",\"\",'AS1'!D28)","v":""},{"$f":"IF('AS1'!E28=\"\",\"\",'AS1'!E28)","v":""},{"$f":"'AS2'!BF28","v":0},0,{"$f":"'DOC2'!R29","v":0},{"$f":"PRAC2!R29","v":0},{"$f":"'AUT2'!R29","v":0},0,{"$f":"VLOOKUP(K36,RESERVADO!A$1:B$1001,2)","v":"CERO"}]
[null,null,25,{"$f":"IF('AS1'!D29=\"\",\"\",'AS1'!D29)","v":""},{"$f":"IF('AS1'!E29=\"\",\"\",'AS1'!E29)","v":""},{"$f":"'AS2'!BF29","v":0},0,{"$f":"'DOC2'!R30","v":0},{"$f":"PRAC2!R30","v":0},{"$f":"'AUT2'!R30","v":0},0,{"$f":"VLOOKUP(K37,RESERVADO!A$1:B$1001,2)","v":"CERO"}]
[null,null,26,{"$f":"IF('AS1'!D30=\"\",\"\",'AS1'!D30)","v":""},{"$f":"IF('AS1'!E30=\"\",\"\",'AS1'!E30)","v":""},{"$f":"'AS2'!BF30","v":0},0,{"$f":"'DOC2'!R31","v":0},{"$f":"PRAC2!R31","v":0},{"$f":"'AUT2'!R31","v":0},0,{"$f":"VLOOKUP(K38,RESERVADO!A$1:B$1001,2)","v":"CERO"}]
[null,null,27,{"$f":"IF('AS1'!D31=\"\",\"\",'AS1'!D31)","v":""},{"$f":"IF('AS1'!E31=\"\",\"\",'AS1'!E31)","v":""},{"$f":"'AS2'!BF31","v":0},0,{"$f":"'DOC2'!R32","v":0},{"$f":"PRAC2!R32","v":0},{"$f":"'AUT2'!R32","v":0},0,{"$f":"VLOOKUP(K39,RESERVADO!A$1:B$1001,2)","v":"CERO"}]
[null,null,28,{"$f":"IF('AS1'!D32=\"\",\"\",'AS1'!D32)","v":""},{"$f":"IF('AS1'!E32=\"\",\"\",'AS1'!E32)","v":""},{"$f":"'AS2'!BF32","v":0},0,{"$f":"'DOC2'!R33","v":0},{"$f":"PRAC2!R33","v":0},{"$f":"'AUT2'!R33","v":0},0,{"$f":"VLOOKUP(K40,RESERVADO!A$1:B$1001,2)","v":"CERO"}]
[null,null,29,{"$f":"IF('AS1'!D33=\"\",\"\",'AS1'!D33)","v":""},{"$f":"IF('AS1'!E33=\"\",\"\",'AS1'!E33)","v":""},{"$f":"'AS2'!BF33","v":0},0,{"$f":"'DOC2'!R34","v":0},{"$f":"PRAC2!R34","v":0},{"$f":"'AUT2'!R34","v":0},0,{"$f":"VLOOKUP(K41,RESERVADO!A$1:B$1001,2)","v":"CERO"}]
[null,null,30,{"$f":"IF('AS1'!D34=\"\",\"\",'AS1'!D34)","v":""},{"$f":"IF('AS1'!E34=\"\",\"\",'AS1'!E34)","v":""},{"$f":"'AS2'!BF34","v":0},0,{"$f":"'DOC2'!R35","v":0},{"$f":"PRAC2!R35","v":0},{"$f":"'AUT2'!R35","v":0},0,{"$f":"VLOOKUP(K42,RESERVADO!A$1:B$1001,2)","v":"CERO"}]
[null,null,31,{"$f":"IF('AS1'!D35=\"\",\"\",'AS1'!D35)","v":""},{"$f":"IF('AS1'!E35=\"\",\"\",'AS1'!E35)","v":""},{"$f":"'AS2'!BF35","v":0},0,{"$f":"'DOC2'!R36","v":0},{"$f":"PRAC2!R36","v":0},{"$f":"'AUT2'!R36","v":0},0,{"$f":"VLOOKUP(K43,RESERVADO!A$1:B$1001,2)","v":"CERO"}]
[null,null,32,{"$f":"IF('AS1'!D36=\"\",\"\",'AS1'!D36)","v":""},{"$f":"IF('AS1'!E36=\"\",\"\",'AS1'!E36)","v":""},{"$f":"'AS2'!BF36","v":0},0,{"$f":"'DOC2'!R37","v":0},{"$f":"PRAC2!R37","v":0},{"$f":"'AUT2'!R37","v":0},0,{"$f":"VLOOKUP(K44,RESERVADO!A$1:B$1001,2)","v":"CERO"}]
[null,null,33,{"$f":"IF('AS1'!D37=\"\",\"\",'AS1'!D37)","v":""},{"$f":"IF('AS1'!E37=\"\",\"\",'AS1'!E37)","v":""},{"$f":"'AS2'!BF37","v":0},0,{"$f":"'DOC2'!R38","v":0},{"$f":"PRAC2!R38","v":0},{"$f":"'AUT2'!R38","v":0},0,{"$f":"VLOOKUP(K45,RESERVADO!A$1:B$1001,2)","v":"CERO"}]
[null,null,34,{"$f":"IF('AS1'!D38=\"\",\"\",'AS1'!D38)","v":""},{"$f":"IF('AS1'!E38=\"\",\"\",'AS1'!E38)","v":""},{"$f":"'AS2'!BF38","v":0},0,{"$f":"'DOC2'!R39","v":0},{"$f":"PRAC2!R39","v":0},{"$f":"'AUT2'!R39","v":0},0,{"$f":"VLOOKUP(K46,RESERVADO!A$1:B$1001,2)","v":"CERO"}]
[null,null,35,{"$f":"IF('AS1'!D39=\"\",\"\",'AS1'!D39)","v":""},{"$f":"IF('AS1'!E39=\"\",\"\",'AS1'!E39)","v":""},{"$f":"'AS2'!BF39","v":0},0,{"$f":"'DOC2'!R40","v":0},{"$f":"PRAC2!R40","v":0},{"$f":"'AUT2'!R40","v":0},0,{"$f":"VLOOKUP(K47,RESERVADO!A$1:B$1001,2)","v":"CERO"}]
[null,null,36,{"$f":"IF('AS1'!D40=\"\",\"\",'AS1'!D40)","v":""},{"$f":"IF('AS1'!E40=\"\",\"\",'AS1'!E40)","v":""},{"$f":"'AS2'!BF40","v":0},0,{"$f":"'DOC2'!R41","v":0},{"$f":"PRAC2!R41","v":0},{"$f":"'AUT2'!R41","v":0},0,{"$f":"VLOOKUP(K48,RESERVADO!A$1:B$1001,2)","v":"CERO"}]
[null,null,37,{"$f":"IF('AS1'!D41=\"\",\"\",'AS1'!D41)","v":""},{"$f":"IF('AS1'!E41=\"\",\"\",'AS1'!E41)","v":""},{"$f":"'AS2'!BF41","v":0},0,{"$f":"'DOC2'!R42","v":0},{"$f":"PRAC2!R42","v":0},{"$f":"'AUT2'!R42","v":0},{"$f":"SUM(H49:J49)","v":0},{"$f":"VLOOKUP(K49,RESERVADO!A$1:B$1001,2)","v":"CERO"}]
[null,null,38,{"$f":"IF('AS1'!D42=\"\",\"\",'AS1'!D42)","v":""},{"$f":"IF('AS1'!E42=\"\",\"\",'AS1'!E42)","v":""},{"$f":"'AS2'!BF42","v":0},0,{"$f":"'DOC2'!R43","v":0},{"$f":"PRAC2!R43","v":0},{"$f":"'AUT2'!R43","v":0},0,{"$f":"VLOOKUP(K50,RESERVADO!A$1:B$1001,2)","v":"CERO"}]
[null,null,39,{"$f":"IF('AS1'!D43=\"\",\"\",'AS1'!D43)","v":""},{"$f":"IF('AS1'!E43=\"\",\"\",'AS1'!E43)","v":""},{"$f":"'AS2'!BF43","v":0},0,{"$f":"'DOC2'!R44","v":0},{"$f":"PRAC2!R44","v":0},{"$f":"'AUT2'!R44","v":0},0,{"$f":"VLOOKUP(K51,RESERVADO!A$1:B$1001,2)","v":"CERO"}]
[null,null,40,{"$f":"IF('AS1'!D44=\"\",\"\",'AS1'!D44)","v":""},{"$f":"IF('AS1'!E44=\"\",\"\",'AS1'!E44)","v":""},{"$f":"'AS2'!BF44","v":0},0,{"$f":"'DOC2'!R45","v":0},{"$f":"PRAC2!R45","v":0},{"$f":"'AUT2'!R45","v":0},0,{"$f":"VLOOKUP(K52,RESERVADO!A$1:B$1001,2)","v":"CERO"}]
[null,null,41,{"$f":"IF('AS1'!D45=\"\",\"\",'AS1'!D45)","v":""},{"$f":"IF('AS1'!E45=\"\",\"\",'AS1'!E45)","v":""},{"$f":"'AS2'!BF45","v":0},0,{"$f":"'DOC2'!R46","v":0},{"$f":"PRAC2!R46","v":0},{"$f":"'AUT2'!R46","v":0},0,{"$f":"VLOOKUP(K53,RESERVADO!A$1:B$1001,2)","v":"CERO"}]
[null,null,42,{"$f":"IF('AS1'!D46=\"\",\"\",'AS1'!D46)","v":""},{"$f":"IF('AS1'!E46=\"\",\"\",'AS1'!E46)","v":""},{"$f":"'AS2'!BF46","v":0},0,{"$f":"'DOC2'!R47","v":0},{"$f":"PRAC2!R47","v":0},{"$f":"'AUT2'!R47","v":0},0,{"$f":"VLOOKUP(K54,RESERVADO!A$1:B$1001,2)","v":"CERO"}]
[null,null,43,{"$f":"IF('AS1'!D47=\"\",\"\",'AS1'!D47)","v":""},{"$f":"IF('AS1'!E47=\"\",\"\",'AS1'!E47)","v":""},{"$f":"'AS2'!BF47","v":0},0,{"$f":"'DOC2'!R48","v":0},{"$f":"PRAC2!R48","v":0},{"$f":"'AUT2'!R48","v":0},0,{"$f":"VLOOKUP(K55,RESERVADO!A$1:B$1001,2)","v":"CERO"}]
[null,null,44,{"$f":"IF('AS1'!D48=\"\",\"\",'AS1'!D48)","v":""},{"$f":"IF('AS1'!E48=\"\",\"\",'AS1'!E48)","v":""},{"$f":"'AS2'!BF48","v":0},0,{"$f":"'DOC2'!R49","v":0},{"$f":"PRAC2!R49","v":0},{"$f":"'AUT2'!R49","v":0},0,{"$f":"VLOOKUP(K56,RESERVADO!A$1:B$1001,2)","v":"CERO"}]
[null,null,45,{"$f":"IF('AS1'!D49=\"\",\"\",'AS1'!D49)","v":""},{"$f":"IF('AS1'!E49=\"\",\"\",'AS1'!E49)","v":""},{"$f":"'AS2'!BF49","v":0},0,{"$f":"'DOC2'!R50","v":0},{"$f":"PRAC2!R50","v":0},{"$f":"'AUT2'!R50","v":0},0,{"$f":"VLOOKUP(K57,RESERVADO!A$1:B$1001,2)","v":"CERO"}]
[null,null,46,{"$f":"IF('AS1'!D50=\"\",\"\",'AS1'!D50)","v":""},{"$f":"IF('AS1'!E50=\"\",\"\",'AS1'!E50)","v":""},{"$f":"'AS2'!BF50","v":0},0,{"$f":"'DOC2'!R51","v":0},{"$f":"PRAC2!R51","v":0},{"$f":"'AUT2'!R51","v":0},0,{"$f":"VLOOKUP(K58,RESERVADO!A$1:B$1001,2)","v":"CERO"}]
[null,null,47,{"$f":"IF('AS1'!D51=\"\",\"\",'AS1'!D51)","v":""},{"$f":"IF('AS1'!E51=\"\",\"\",'AS1'!E51)","v":""},{"$f":"'AS2'!BF51","v":0},0,{"$f":"'DOC2'!R52","v":0},{"$f":"PRAC2!R52","v":0},{"$f":"'AUT2'!R52","v":0},0,{"$f":"VLOOKUP(K59,RESERVADO!A$1:B$1001,2)","v":"CERO"}]
[null,null,48,{"$f":"IF('AS1'!D52=\"\",\"\",'AS1'!D52)","v":""},{"$f":"IF('AS1'!E52=\"\",\"\",'AS1'!E52)","v":""},{"$f":"'AS2'!BF52","v":0},0,{"$f":"'DOC2'!R53","v":0},{"$f":"PRAC2!R53","v":0},{"$f":"'AUT2'!R53","v":0},0,{"$f":"VLOOKUP(K60,RESERVADO!A$1:B$1001,2)","v":"CERO"}]
[null,null,49,{"$f":"IF('AS1'!D53=\"\",\"\",'AS1'!D53)","v":""},{"$f":"IF('AS1'!E53=\"\",\"\",'AS1'!E53)","v":""},{"$f":"'AS2'!BF53","v":0},0,{"$f":"'DOC2'!R54","v":0},{"$f":"PRAC2!R54","v":0},{"$f":"'AUT2'!R54","v":0},0,{"$f":"VLOOKUP(K61,RESERVADO!A$1:B$1001,2)","v":"CERO"}]
[null,null,50,{"$f":"IF('AS1'!D54=\"\",\"\",'AS1'!D54)","v":""},{"$f":"IF('AS1'!E54=\"\",\"\",'AS1'!E54)","v":""},{"$f":"'AS2'!BF54","v":0},0,{"$f":"'DOC2'!R55","v":0},{"$f":"PRAC2!R55","v":0},{"$f":"'AUT2'!R55","v":0},0,{"$f":"VLOOKUP(K62,RESERVADO!A$1:B$1001,2)","v":"CERO"}]
[null,null,51,{"$f":"IF('AS1'!D55=\"\",\"\",'AS1'!D55)","v":""},{"$f":"IF('AS1'!E55=\"\",\"\",'AS1'!E55)","v":""},{"$f":"'AS2'!BF55","v":0},0,{"$f":"'DOC2'!R56","v":0},{"$f":"PRAC2!R56","v":0},{"$f":"'AUT2'!R56","v":0},0,{"$f":"VLOOKUP(K63,RESERVADO!A$1:B$1001,2)","v":"CERO"}]
[null,null,52,{"$f":"IF('AS1'!D56=\"\",\"\",'AS1'!D56)","v":""},{"$f":"IF('AS1'!E56=\"\",\"\",'AS1'!E56)","v":""},{"$f":"'AS2'!BF56","v":0},0,{"$f":"'DOC2'!R57","v":0},{"$f":"PRAC2!R57","v":0},{"$f":"'AUT2'!R57","v":0},0,{"$f":"VLOOKUP(K64,RESERVADO!A$1:B$1001,2)","v":"CERO"}]
[null,null,53,{"$f":"IF('AS1'!D57=\"\",\"\",'AS1'!D57)","v":""},{"$f":"IF('AS1'!E57=\"\",\"\",'AS1'!E57)","v":""},{"$f":"'AS2'!BF57","v":0},0,{"$f":"'DOC2'!R58","v":0},{"$f":"PRAC2!R58","v":0},{"$f":"'AUT2'!R58","v":0},0,{"$f":"VLOOKUP(K65,RESERVADO!A$1:B$1001,2)","v":"CERO"}]
[null,null,54,{"$f":"IF('AS1'!D58=\"\",\"\",'AS1'!D58)","v":""},{"$f":"IF('AS1'!E58=\"\",\"\",'AS1'!E58)","v":""},{"$f":"'AS2'!BF58","v":0},0,{"$f":"'DOC2'!R59","v":0},{"$f":"PRAC2!R59","v":0},{"$f":"'AUT2'!R59","v":0},0,{"$f":"VLOOKUP(K66,RESERVADO!A$1:B$1001,2)","v":"CERO"}]
[null,null,55,{"$f":"IF('AS1'!D59=\"\",\"\",'AS1'!D59)","v":""},{"$f":"IF('AS1'!E59=\"\",\"\",'AS1'!E59)","v":""},{"$f":"'AS2'!BF59","v":0},0,{"$f":"'DOC2'!R60","v":0},{"$f":"PRAC2!R60","v":0},{"$f":"'AUT2'!R60","v":0},0,{"$f":"VLOOKUP(K67,RESERVADO!A$1:B$1001,2)","v":"CERO"}]
[null,null,56,{"$f":"IF('AS1'!D60=\"\",\"\",'AS1'!D60)","v":""},{"$f":"IF('AS1'!E60=\"\",\"\",'AS1'!E60)","v":""},{"$f":"'AS2'!BF60","v":0},0,{"$f":"'DOC2'!R61","v":0},{"$f":"PRAC2!R61","v":0},{"$f":"'AUT2'!R61","v":0},0,{"$f":"VLOOKUP(K68,RESERVADO!A$1:B$1001,2)","v":"CERO"}]
[null,null,57,{"$f":"IF('AS1'!D61=\"\",\"\",'AS1'!D61)","v":""},{"$f":"IF('AS1'!E61=\"\",\"\",'AS1'!E61)","v":""},{"$f":"'AS2'!BF61","v":0},0,{"$f":"'DOC2'!R62","v":0},{"$f":"PRAC2!R62","v":0},{"$f":"'AUT2'!R62","v":0},0,{"$f":"VLOOKUP(K69,RESERVADO!A$1:B$1001,2)","v":"CERO"}]
[null,null,58,{"$f":"IF('AS1'!D62=\"\",\"\",'AS1'!D62)","v":""},{"$f":"IF('AS1'!E62=\"\",\"\",'AS1'!E62)","v":""},{"$f":"'AS2'!BF62","v":0},0,{"$f":"'DOC2'!R63","v":0},{"$f":"PRAC2!R63","v":0},{"$f":"'AUT2'!R63","v":0},0,{"$f":"VLOOKUP(K70,RESERVADO!A$1:B$1001,2)","v":"CERO"}]
[null,null,59,{"$f":"IF('AS1'!D63=\"\",\"\",'AS1'!D63)","v":""},{"$f":"IF('AS1'!E63=\"\",\"\",'AS1'!E63)","v":""},{"$f":"'AS2'!BF63","v":0},0,{"$f":"'DOC2'!R64","v":0},{"$f":"PRAC2!R64","v":0},{"$f":"'AUT2'!R64","v":0},0,{"$f":"VLOOKUP(K71,RESERVADO!A$1:B$1001,2)","v":"CERO"}]
[null,null,60,{"$f":"IF('AS1'!D64=\"\",\"\",'AS1'!D64)","v":""},{"$f":"IF('AS1'!E64=\"\",\"\",'AS1'!E64)","v":""},{"$f":"'AS2'!BF64","v":0},0,{"$f":"'DOC2'!R65","v":0},{"$f":"PRAC2!R65","v":0},{"$f":"'AUT2'!R65","v":0},0,{"$f":"VLOOKUP(K72,RESERVADO!A$1:B$1001,2)","v":"CERO"}]
[null,null,61,{"$f":"IF('AS1'!D65=\"\",\"\",'AS1'!D65)","v":""},{"$f":"IF('AS1'!E65=\"\",\"\",'AS1'!E65)","v":""},{"$f":"'AS2'!BF65","v":0},0,{"$f":"'DOC2'!R66","v":0},{"$f":"PRAC2!R66","v":0},{"$f":"'AUT2'!R66","v":0},0,{"$f":"VLOOKUP(K73,RESERVADO!A$1:B$1001,2)","v":"CERO"}]
[null,null,62,{"$f":"IF('AS1'!D66=\"\",\"\",'AS1'!D66)","v":""},{"$f":"IF('AS1'!E66=\"\",\"\",'AS1'!E66)","v":""},{"$f":"'AS2'!BF66","v":0},0,{"$f":"'DOC2'!R67","v":0},{"$f":"PRAC2!R67","v":0},{"$f":"'AUT2'!R67","v":0},0,{"$f":"VLOOKUP(K74,RESERVADO!A$1:B$1001,2)","v":"CERO"}]
[null,null,63,{"$f":"IF('AS1'!D67=\"\",\"\",'AS1'!D67)","v":""},{"$f":"IF('AS1'!E67=\"\",\"\",'AS1'!E67)","v":""},{"$f":"'AS2'!BF67","v":0},0,{"$f":"'DOC2'!R68","v":0},{"$f":"PRAC2!R68","v":0},{"$f":"'AUT2'!R68","v":0},0,{"$f":"VLOOKUP(K75,RESERVADO!A$1:B$1001,2)","v":"CERO"}]
[null,null,64,{"$f":"IF('AS1'!D68=\"\",\"\",'AS1'!D68)","v":""},{"$f":"IF('AS1'!E68=\"\",\"\",'AS1'!E68)","v":""},{"$f":"'AS2'!BF68","v":0},0,{"$f":"'DOC2'!R69","v":0},{"$f":"PRAC2!R69","v":0},{"$f":"'AUT2'!R69","v":0},0,{"$f":"VLOOKUP(K76,RESERVADO!A$1:B$1001,2)","v":"CERO"}]
[null,null,65,{"$f":"IF('AS1'!D69=\"\",\"\",'AS1'!D69)","v":""},{"$f":"IF('AS1'!E69=\"\",\"\",'AS1'!E69)","v":""},{"$f":"'AS2'!BF69","v":0},0,{"$f":"'DOC2'!R70","v":0},{"$f":"PRAC2!R70","v":0},{"$f":"'AUT2'!R70","v":0},0,{"$f":"VLOOKUP(K77,RESERVADO!A$1:B$1001,2)","v":"CERO"}]
[null,null,66,{"$f":"IF('AS1'!D70=\"\",\"\",'AS1'!D70)","v":""},{"$f":"IF('AS1'!E70=\"\",\"\",'AS1'!E70)","v":""},{"$f":"'AS2'!BF70","v":0},0,{"$f":"'DOC2'!R71","v":0},{"$f":"PRAC2!R71","v":0},{"$f":"'AUT2'!R71","v":0},0,{"$f":"VLOOKUP(K78,RESERVADO!A$1:B$1001,2)","v":"CERO"}]
[null,null,67,{"$f":"IF('AS1'!D71=\"\",\"\",'AS1'!D71)","v":""},{"$f":"IF('AS1'!E71=\"\",\"\",'AS1'!E71)","v":""},{"$f":"'AS2'!BF71","v":0},0,{"$f":"'DOC2'!R72","v":0},{"$f":"PRAC2!R72","v":0},{"$f":"'AUT2'!R72","v":0},0,{"$f":"VLOOKUP(K79,RESERVADO!A$1:B$1001,2)","v":"CERO"}]
[null,null,68,{"$f":"IF('AS1'!D72=\"\",\"\",'AS1'!D72)","v":""},{"$f":"IF('AS1'!E72=\"\",\"\",'AS1'!E72)","v":""},{"$f":"'AS2'!BF72","v":0},{"$f":"IF(L$8=0,0,(F80*100)/L$8)","v":0},{"$f":"'DOC2'!R73","v":0},{"$f":"PRAC2!R73","v":0},{"$f":"'AUT2'!R73","v":0},0,{"$f":"VLOOKUP(K80,RESERVADO!A$1:B$1001,2)","v":"CERO"}]
[null,null,69,{"$f":"IF('AS1'!D73=\"\",\"\",'AS1'!D73)","v":""},{"$f":"IF('AS1'!E73=\"\",\"\",'AS1'!E73)","v":""},{"$f":"'AS2'!BF73","v":0},0,{"$f":"'DOC2'!R74","v":0},{"$f":"PRAC2!R74","v":0},{"$f":"'AUT2'!R74","v":0},{"$f":"SUM(H81:J81)","v":0},{"$f":"VLOOKUP(K81,RESERVADO!A$1:B$1001,2)","v":"CERO"}]
[null,null,70,{"$f":"IF('AS1'!D74=\"\",\"\",'AS1'!D74)","v":""},{"$f":"IF('AS1'!E74=\"\",\"\",'AS1'!E74)","v":""},{"$f":"'AS2'!BF74","v":0},0,{"$f":"'DOC2'!R75","v":0},{"$f":"PRAC2!R75","v":0},{"$f":"'AUT2'!R75","v":0},0,{"$f":"VLOOKUP(K82,RESERVADO!A$1:B$1001,2)","v":"CERO"}]

{"sheet":"INFORME2","index":12,"n_rows":34,"n_cols":9,"rows_kept":34,"cut":false,"hidden":true,"merged":[[8,2,8,7],[2,1,2,12],[4,2,4,7],[5,2,5,7],[6,2,6,7],[7,2,7,11],[20,2,20,4],[9,2,9,5],[10,2,10,7],[11,3,11,5],[12,3,12,5],[14,1,14,11],[15,3,15,5],[15,6,15,11],[16,3,16,5],[16,6,16,11],[17,3,17,5],[17,6,17,11],[19,1,19,11],[21,2,21,4],[22,2,22,4],[23,2,23,4],[25,2,25,3],[25,4,25,5],[36,8,36,11],[25,8,26,8],[26,2,26,3],[26,4,26,5],[26,6,26,7],[30,1,30,10],[30,11,30,12],[25,6,25,7],[32,3,32,5],[32,8,32,11],[33,8,33,11],[34,8,34,11],[35,8,35,11],[43,8,43,11],[44,8,44,11],[45,8,45,11],[46,3,46,5],[37,8,37,11],[38,8,38,11],[39,8,39,11],[40,8,40,11],[41,8,41,11],[42,8,42,11]]}
[]
[]
[null,"INFORME ACADÉMICO"]
[]
[null,null,{"$f":"CONCATENATE(INICIO!C7,INICIO!D7)","v":"PERIODO ACADÉMICO:  2024 -  2025"}]
[null,null,{"$f":"CONCATENATE(INICIO!C5,INICIO!D5)","v":"FACULTAD:  Ciencias de la Salud"}]
[null,null,{"$f":"CONCATENATE(INICIO!C6,INICIO!D6)","v":"CARRERA: Enfermería"}]
[null,null,"ESTADO: Vigente ( X  )   No Vigente habilitada para registro de títulos (   )"]
[null,null,{"$f":"CONCATENATE(INICIO!C8,INICIO!D8,\" \",INICIO!D9)","v":"SEMESTRE: 6to A"}]
[null,null,{"$f":"CONCATENATE(INICIO!C11,INICIO!D11)","v":"ASIGNATURA: Enfermería Gíneco oObstétrica II"}]
[null,null,"PARCIAL: Primero (  )  Segundo ( x )"]
[null,null,"PROFESOR:",{"$f":"IF(INICIO!D4=\"\",\"\",INICIO!D4)","v":"Graciela Rivera Herrera"}]
[null,null,"FECHA:",{"$f":"TODAY()","v":"2025-02-14"}]
[]
[null,"1.    Resultados de aprendizaje evaluados"]
[null,null,"N° Unidad","Nombre unidad",null,null,"Resultados de aprendizaje"]
[]
[]
[]
[null,"2.    Rendimiento Académico"]
[null,null,"Promedio de asistencia del curso:",null,null,{"$f":"CONCATENATE(ROUND(IF(F23=0,0,AVERAGEIF(PARCIAL2!G13:G82,\">0\")),2),\" \",\"%\")","v":"97,88 %"}]
[null,null,"Promedio de calificaciones del curso: ",null,null,{"$f":"IF(F23=0,0,AVERAGEIF(PARCIAL2!K13:K82,\">0\"))","v":7.3540714285714293}]
[null,null,"Numero Total de Estudiantes:",null,null,{"$f":"COUNTIF('AS1'!E5:E74,\"*\")","v":8}]
[null,null,"Número de Estudiantes sin Calificaciones:",null,null,{"$f":"COUNTIFS(PARCIAL2!K13:K82,\"=0\",PARCIAL2!E13:E82,\">*\")","v":1}]
[null,null,"Evaluación del logro de los  resultados de aprendizaje:"]
[null,null,"1.00 - 4.00 ",null,"4.01 - 6.99",null,"7.00 – 10.00",null,"Total de Matriculados"]
[null,null,"No alcanza los resultados de aprendizaje requeridos",null,"Está próximo a alcanzar los resultados de aprendizaje requeridos.",null,"Alcanza los resultados de aprendizaje requeridos satisfactoriamente"]
[null,null,"Número",{"$f":"(F23-(H28+F28))-F24","v":0},"Número",{"$f":"COUNTIFS(PARCIAL2!K13:K82,\">=4,01\",PARCIAL2!K13:K82,\"<=6,99\")","v":2},"Número",{"$f":"COUNTIF(PARCIAL2!K13:K82,\">=7\")","v":5},{"$f":"F23-F24","v":7}]
[null,null,"%",{"$f":"IF($I$28>0,(D28*100%)/$I$28,\" \")","v":0},"%",{"$f":"IF($I$28>0,(F28*100%)/$I$28,\" \")","v":0.2857142857142857},"%",{"$f":"IF($I$28>0,(H28*100%)/$I$28,\" \")","v":0.7142857142857143},1]
[]
[null,"3.    Registro de estudiantes que no alcanzan o están próximos a alcanzar los resultados de aprendizaje requeridos "]
[]
[null,null,"N°","Estudiante",null,null,"Calificación Primer Parcial","% de Asistencia Primer Parcial","Causas del bajo rendimiento académico de los estudiantes"]
[null,null,70]

{"sheet":"FINAL","index":13,"n_rows":81,"n_cols":11,"rows_kept":81,"cut":false,"hidden":false,"merged":[[9,8,9,9],[9,10,10,10],[1,2,1,10],[2,2,2,10],[3,2,3,10],[5,8,5,10],[9,2,10,2],[9,3,10,3],[9,4,9,5],[9,6,10,6],[9,7,10,7],[5,2,5,7],[7,2,7,4],[6,2,6,7],[7,8,7,9],[6,8,6,10],[4,2,4,10]]}
[]
[null,null,"UNIVERSIDAD NACIONAL DE CHIMBORAZO"]
[null,null,{"$f":"CONCATENATE(\"FACULTAD DE \",INICIO!D5)","v":"FACULTAD DE Ciencias de la Salud"}]
[null,null,{"$f":"CONCATENATE(\"CARRERA DE \",INICIO!D6)","v":"CARRERA DE Enfermería"}]
[null,null,"ACTA FINAL DE CALIFICACIONES "]
[null,null,{"$f":"CONCATENATE(\"SEMESTRE: \",INICIO!D8)","v":"SEMESTRE: 6to"},null,null,null,null,null,{"$f":"CONCATENATE(INICIO!C11,INICIO!D11)","v":"ASIGNATURA: Enfermería Gíneco oObstétrica II"}]
[null,null,{"$f":"CONCATENATE(\"PARALELO: \",INICIO!D9)","v":"PARALELO: A"},null,null,null,null,null,{"$f":"CONCATENATE(\"DOCENTE: \",INICIO!D4)","v":"DOCENTE: Graciela Rivera Herrera"}]
[null,null,{"$f":"CONCATENATE(\"PERIODO LECTIVO:\",INICIO!D7)","v":"PERIODO LECTIVO: 2024 -  2025"},null,null,null,null,null,"NRO. TOTAL DE  HORAS LAOBARDAS:",null,{"$f":"PARCIAL1!L8+PARCIAL2!L8","v":106}]
[]
[null,null,"N","NOMINA","ASISTENCIA",null,"PARCIAL 1","PARCIAL2","PROMEDIO",null,"Observación"]
[null,null,null,null,"N","%",null,null,"Números","Letras"]
[null,null,1,{"$f":"IF('AS1'!E5=\"\",\"\",'AS1'!E5)","v":"DAQUILEMA LONDO SHIRLEY ESTEFAFANÍA"},{"$f":"PARCIAL1!F13+PARCIAL2!F13","v":106},{"$f":"IF(K$8=0,0,(E12*100%)/K$8)","v":1},{"$f":"PARCIAL1!K13","v":7.84},{"$f":"PARCIAL2!K13","v":7.4855},{"$f":"IF(MOD((G12+H12),2)>=1,ROUND((G12+H12)/2,0),ROUND((G12+H12)/2,2))","v":8},{"$f":"VLOOKUP(I12,RESERVADO!A$1:B$1001,2)","v":"OCHO"},{"$f":"IF(D12=\"\",\" \",IF(AND(D12<>\"\",I12=0),\"retirado\",IF(AND(I12>=7,F12>=70%),\"aprobado\",IF(OR(I12<=4.49,F12<70%),\"reprobado\",IF(AND(I12>=5,F12>=70%),\"suspenso\")))))","v":"aprobado"}]
[null,null,2,{"$f":"IF('AS1'!E6=\"\",\"\",'AS1'!E6)","v":"GOYES ORTIZ NATASHA DAYANA"},{"$f":"PARCIAL1!F14+PARCIAL2!F14","v":98},{"$f":"IF(K$8=0,0,(E13*100%)/K$8)","v":0.92452830188679247},{"$f":"PARCIAL1!K14","v":8.52},{"$f":"PARCIAL2!K14","v":8.2794999999999987},{"$f":"IF(MOD((G13+H13),2)>=1,ROUND((G13+H13)/2,0),ROUND((G13+H13)/2,2))","v":8.4},{"$f":"VLOOKUP(I13,RESERVADO!A$1:B$1001,2)","v":"OCHO.CUARENTA"},"aprobado"]
[null,null,3,{"$f":"IF('AS1'!E7=\"\",\"\",'AS1'!E7)","v":"GUADALUPE RUIZ YULISA NATALY"},{"$f":"PARCIAL1!F15+PARCIAL2!F15","v":106},1,{"$f":"PARCIAL1!K15","v":7.14},{"$f":"PARCIAL2!K15","v":6.9220000000000006},7.03,{"$f":"VLOOKUP(I14,RESERVADO!A$1:B$1001,2)","v":"SIETE.CERO TRES"},"aprobado"]
[null,null,4,{"$f":"IF('AS1'!E8=\"\",\"\",'AS1'!E8)","v":"MELO CHAVEZ KEVIN JOSUE"},{"$f":"PARCIAL1!F16+PARCIAL2!F16","v":104},0.98113207547169812,{"$f":"PARCIAL1!K16","v":8},{"$f":"PARCIAL2!K16","v":7.557500000000001},8,{"$f":"VLOOKUP(I15,RESERVADO!A$1:B$1001,2)","v":"OCHO"},"aprobado"]
[null,null,5,{"$f":"IF('AS1'!E9=\"\",\"\",'AS1'!E9)","v":"MULLO PAUCAR ADRIANA ANABEL"},{"$f":"PARCIAL1!F17+PARCIAL2!F17","v":106},1,{"$f":"PARCIAL1!K17","v":7.73},{"$f":"PARCIAL2!K17","v":7.5485000000000007},8,{"$f":"VLOOKUP(I16,RESERVADO!A$1:B$1001,2)","v":"OCHO"},"aprobado"]
[null,null,6,{"$f":"IF('AS1'!E10=\"\",\"\",'AS1'!E10)","v":"NARANJO PALACIOS FERNANDA BRIGUITTE"},{"$f":"PARCIAL1!F18+PARCIAL2!F18","v":18},0.16981132075471697,{"$f":"PARCIAL1!K18","v":1.86},{"$f":"PARCIAL2!K18","v":0},1,{"$f":"VLOOKUP(I17,RESERVADO!A$1:B$1001,2)","v":"UNO"},"reprobado"]
[null,null,7,{"$f":"IF('AS1'!E11=\"\",\"\",'AS1'!E11)","v":"SOTO VARGAS ERIKA SAMANTA"},{"$f":"PARCIAL1!F19+PARCIAL2!F19","v":108},1.0188679245283019,{"$f":"PARCIAL1!K19","v":6.72},{"$f":"PARCIAL2!K19","v":7.6715},7.2,{"$f":"VLOOKUP(I18,RESERVADO!A$1:B$1001,2)","v":"SIETE.VEINTE"},"aprobado"]
[null,null,8,{"$f":"IF('AS1'!E12=\"\",\"\",'AS1'!E12)","v":"VALLEJO ORDOÑEZ SAYONARA ELIZABETH"},{"$f":"PARCIAL1!F20+PARCIAL2!F20","v":106},1,{"$f":"PARCIAL1!K20","v":6.38},{"$f":"PARCIAL2!K20","v":6.0140000000000002},6.2,{"$f":"VLOOKUP(I19,RESERVADO!A$1:B$1001,2)","v":"SEIS.VEINTE"},"suspenso"]
[null,null,9,{"$f":"IF('AS1'!E13=\"\",\"\",'AS1'!E13)","v":""},{"$f":"PARCIAL1!F21+PARCIAL2!F21","v":0},0,{"$f":"PARCIAL1!K21","v":0},{"$f":"PARCIAL2!K21","v":0},0,{"$f":"VLOOKUP(I20,RESERVADO!A$1:B$1001,2)","v":"CERO"}," "]
[null,null,10,{"$f":"IF('AS1'!E14=\"\",\"\",'AS1'!E14)","v":""},{"$f":"PARCIAL1!F22+PARCIAL2!F22","v":0},0,{"$f":"PARCIAL1!K22","v":0},{"$f":"PARCIAL2!K22","v":0},0,{"$f":"VLOOKUP(I21,RESERVADO!A$1:B$1001,2)","v":"CERO"}," "]
[null,null,11,{"$f":"IF('AS1'!E15=\"\",\"\",'AS1'!E15)","v":""},{"$f":"PARCIAL1!F23+PARCIAL2!F23","v":0},0,{"$f":"PARCIAL1!K23","v":0},{"$f":"PARCIAL2!K23","v":0},0,{"$f":"VLOOKUP(I22,RESERVADO!A$1:B$1001,2)","v":"CERO"}," "]
[null,null,12,{"$f":"IF('AS1'!E16=\"\",\"\",'AS1'!E16)","v":""},{"$f":"PARCIAL1!F24+PARCIAL2!F24","v":0},0,{"$f":"PARCIAL1!K24","v":0},{"$f":"PARCIAL2!K24","v":0},0,{"$f":"VLOOKUP(I23,RESERVADO!A$1:B$1001,2)","v":"CERO"}," "]
[null,null,13,{"$f":"IF('AS1'!E17=\"\",\"\",'AS1'!E17)","v":""},{"$f":"PARCIAL1!F25+PARCIAL2!F25","v":0},0,{"$f":"PARCIAL1!K25","v":0},{"$f":"PARCIAL2!K25","v":0},0,{"$f":"VLOOKUP(I24,RESERVADO!A$1:B$1001,2)","v":"CERO"}," "]
[null,null,14,{"$f":"IF('AS1'!E18=\"\",\"\",'AS1'!E18)","v":""},{"$f":"PARCIAL1!F26+PARCIAL2!F26","v":0},0,{"$f":"PARCIAL1!K26","v":0},{"$f":"PARCIAL2!K26","v":0},0,{"$f":"VLOOKUP(I25,RESERVADO!A$1:B$1001,2)","v":"CERO"}," "]
[null,null,15,{"$f":"IF('AS1'!E19=\"\",\"\",'AS1'!E19)","v":""},{"$f":"PARCIAL1!F27+PARCIAL2!F27","v":0},0,{"$f":"PARCIAL1!K27","v":0},{"$f":"PARCIAL2!K27","v":0},0,{"$f":"VLOOKUP(I26,RESERVADO!A$1:B$1001,2)","v":"CERO"}," "]
[null,null,16,{"$f":"IF('AS1'!E20=\"\",\"\",'AS1'!E20)","v":""},{"$f":"PARCIAL1!F28+PARCIAL2!F28","v":0},0,{"$f":"PARCIAL1!K28","v":0},{"$f":"PARCIAL2!K28","v":0},0,{"$f":"VLOOKUP(I27,RESERVADO!A$1:B$1001,2)","v":"CERO"}," "]
[null,null,17,{"$f":"IF('AS1'!E21=\"\",\"\",'AS1'!E21)","v":""},{"$f":"PARCIAL1!F29+PARCIAL2!F29","v":0},0,{"$f":"PARCIAL1!K29","v":0},{"$f":"PARCIAL2!K29","v":0},0,{"$f":"VLOOKUP(I28,RESERVADO!A$1:B$1001,2)","v":"CERO"}," "]
[null,null,18,{"$f":"IF('AS1'!E22=\"\",\"\",'AS1'!E22)","v":""},{"$f":"PARCIAL1!F30+PARCIAL2!F30","v":0},0,{"$f":"PARCIAL1!K30","v":0},{"$f":"PARCIAL2!K30","v":0},0,{"$f":"VLOOKUP(I29,RESERVADO!A$1:B$1001,2)","v":"CERO"}," "]
[null,null,19,{"$f":"IF('AS1'!E23=\"\",\"\",'AS1'!E23)","v":""},{"$f":"PARCIAL1!F31+PARCIAL2!F31","v":0},0,{"$f":"PARCIAL1!K31","v":0},{"$f":"PARCIAL2!K31","v":0},0,{"$f":"VLOOKUP(I30,RESERVADO!A$1:B$1001,2)","v":"CERO"}," "]
[null,null,20,{"$f":"IF('AS1'!E24=\"\",\"\",'AS1'!E24)","v":""},{"$f":"PARCIAL1!F32+PARCIAL2!F32","v":0},0,{"$f":"PARCIAL1!K32","v":0},{"$f":"PARCIAL2!K32","v":0},0,{"$f":"VLOOKUP(I31,RESERVADO!A$1:B$1001,2)","v":"CERO"}," "]
[null,null,21,{"$f":"IF('AS1'!E25=\"\",\"\",'AS1'!E25)","v":""},{"$f":"PARCIAL1!F33+PARCIAL2!F33","v":0},0,{"$f":"PARCIAL1!K33","v":0},{"$f":"PARCIAL2!K33","v":0},0,{"$f":"VLOOKUP(I32,RESERVADO!A$1:B$1001,2)","v":"CERO"}," "]
[null,null,22,{"$f":"IF('AS1'!E26=\"\",\"\",'AS1'!E26)","v":""},{"$f":"PARCIAL1!F34+PARCIAL2!F34","v":0},0,{"$f":"PARCIAL1!K34","v":0},{"$f":"PARCIAL2!K34","v":0},0,{"$f":"VLOOKUP(I33,RESERVADO!A$1:B$1001,2)","v":"CERO"}," "]
[null,null,23,{"$f":"IF('AS1'!E27=\"\",\"\",'AS1'!E27)","v":""},{"$f":"PARCIAL1!F35+PARCIAL2!F35","v":0},0,{"$f":"PARCIAL1!K35","v":3},{"$f":"PARCIAL2!K35","v":0},2,{"$f":"VLOOKUP(I34,RESERVADO!A$1:B$1001,2)","v":"DOS"}," "]
[null,null,24,{"$f":"IF('AS1'!E28=\"\",\"\",'AS1'!E28)","v":""},{"$f":"PARCIAL1!F36+PARCIAL2!F36","v":0},0,{"$f":"PARCIAL1!K36","v":0},{"$f":"PARCIAL2!K36","v":0},0,{"$f":"VLOOKUP(I35,RESERVADO!A$1:B$1001,2)","v":"CERO"}," "]
[null,null,25,{"$f":"IF('AS1'!E29=\"\",\"\",'AS1'!E29)","v":""},{"$f":"PARCIAL1!F37+PARCIAL2!F37","v":0},0,{"$f":"PARCIAL1!K37","v":0},{"$f":"PARCIAL2!K37","v":0},0,{"$f":"VLOOKUP(I36,RESERVADO!A$1:B$1001,2)","v":"CERO"}," "]
[null,null,26,{"$f":"IF('AS1'!E30=\"\",\"\",'AS1'!E30)","v":""},{"$f":"PARCIAL1!F38+PARCIAL2!F38","v":0},0,{"$f":"PARCIAL1!K38","v":0},{"$f":"PARCIAL2!K38","v":0},0,{"$f":"VLOOKUP(I37,RESERVADO!A$1:B$1001,2)","v":"CERO"}," "]
[null,null,27,{"$f":"IF('AS1'!E31=\"\",\"\",'AS1'!E31)","v":""},{"$f":"PARCIAL1!F39+PARCIAL2!F39","v":0},0,{"$f":"PARCIAL1!K39","v":0},{"$f":"PARCIAL2!K39","v":0},0,{"$f":"VLOOKUP(I38,RESERVADO!A$1:B$1001,2)","v":"CERO"}," "]
[null,null,28,{"$f":"IF('AS1'!E32=\"\",\"\",'AS1'!E32)","v":""},{"$f":"PARCIAL1!F40+PARCIAL2!F40","v":0},0,{"$f":"PARCIAL1!K40","v":0},{"$f":"PARCIAL2!K40","v":0},0,{"$f":"VLOOKUP(I39,RESERVADO!A$1:B$1001,2)","v":"CERO"}," "]
[null,null,29,{"$f":"IF('AS1'!E33=\"\",\"\",'AS1'!E33)","v":""},{"$f":"PARCIAL1!F41+PARCIAL2!F41","v":0},0,{"$f":"PARCIAL1!K41","v":0},{"$f":"PARCIAL2!K41","v":0},0,{"$f":"VLOOKUP(I40,RESERVADO!A$1:B$1001,2)","v":"CERO"}," "]
[null,null,30,{"$f":"IF('AS1'!E34=\"\",\"\",'AS1'!E34)","v":""},{"$f":"PARCIAL1!F42+PARCIAL2!F42","v":0},0,{"$f":"PARCIAL1!K42","v":0},{"$f":"PARCIAL2!K42","v":0},0,{"$f":"VLOOKUP(I41,RESERVADO!A$1:B$1001,2)","v":"CERO"}," "]
[null,null,31,{"$f":"IF('AS1'!E35=\"\",\"\",'AS1'!E35)","v":""},{"$f":"PARCIAL1!F43+PARCIAL2!F43","v":0},0,{"$f":"PARCIAL1!K43","v":0},{"$f":"PARCIAL2!K43","v":0},0,{"$f":"VLOOKUP(I42,RESERVADO!A$1:B$1001,2)","v":"CERO"}," "]
[null,null,32,{"$f":"IF('AS1'!E36=\"\",\"\",'AS1'!E36)","v":""},{"$f":"PARCIAL1!F44+PARCIAL2!F44","v":0},0,{"$f":"PARCIAL1!K44","v":0},{"$f":"PARCIAL2!K44","v":0},0,{"$f":"VLOOKUP(I43,RESERVADO!A$1:B$1001,2)","v":"CERO"}," "]
[null,null,33,{"$f":"IF('AS1'!E37=\"\",\"\",'AS1'!E37)","v":""},{"$f":"PARCIAL1!F45+PARCIAL2!F45","v":0},0,{"$f":"PARCIAL1!K45","v":0},{"$f":"PARCIAL2!K45","v":0},0,{"$f":"VLOOKUP(I44,RESERVADO!A$1:B$1001,2)","v":"CERO"}," "]
[null,null,34,{"$f":"IF('AS1'!E38=\"\",\"\",'AS1'!E38)","v":""},{"$f":"PARCIAL1!F46+PARCIAL2!F46","v":0},0,{"$f":"PARCIAL1!K46","v":0},{"$f":"PARCIAL2!K46","v":0},0,{"$f":"VLOOKUP(I45,RESERVADO!A$1:B$1001,2)","v":"CERO"}," "]
[null,null,35,{"$f":"IF('AS1'!E39=\"\",\"\",'AS1'!E39)","v":""},{"$f":"PARCIAL1!F47+PARCIAL2!F47","v":0},0,{"$f":"PARCIAL1!K47","v":0},{"$f":"PARCIAL2!K47","v":0},0,{"$f":"VLOOKUP(I46,RESERVADO!A$1:B$1001,2)","v":"CERO"}," "]
[null,null,36,{"$f":"IF('AS1'!E40=\"\",\"\",'AS1'!E40)","v":""},{"$f":"PARCIAL1!F48+PARCIAL2!F48","v":0},0,{"$f":"PARCIAL1!K48","v":0},{"$f":"PARCIAL2!K48","v":0},0,{"$f":"VLOOKUP(I47,RESERVADO!A$1:B$1001,2)","v":"CERO"}," "]
[null,null,37,{"$f":"IF('AS1'!E41=\"\",\"\",'AS1'!E41)","v":""},{"$f":"PARCIAL1!F49+PARCIAL2!F49","v":0},0,{"$f":"PARCIAL1!K49","v":0},{"$f":"PARCIAL2!K49","v":0},0,{"$f":"VLOOKUP(I48,RESERVADO!A$1:B$1001,2)","v":"CERO"}," "]
[null,null,38,{"$f":"IF('AS1'!E42=\"\",\"\",'AS1'!E42)","v":""},{"$f":"PARCIAL1!F50+PARCIAL2!F50","v":0},0,{"$f":"PARCIAL1!K50","v":0},{"$f":"PARCIAL2!K50","v":0},0,{"$f":"VLOOKUP(I49,RESERVADO!A$1:B$1001,2)","v":"CERO"}," "]
[null,null,39,{"$f":"IF('AS1'!E43=\"\",\"\",'AS1'!E43)","v":""},{"$f":"PARCIAL1!F51+PARCIAL2!F51","v":0},0,{"$f":"PARCIAL1!K51","v":0},{"$f":"PARCIAL2!K51","v":0},0,{"$f":"VLOOKUP(I50,RESERVADO!A$1:B$1001,2)","v":"CERO"}," "]
[null,null,40,{"$f":"IF('AS1'!E44=\"\",\"\",'AS1'!E44)","v":""},{"$f":"PARCIAL1!F52+PARCIAL2!F52","v":0},0,{"$f":"PARCIAL1!K52","v":0},{"$f":"PARCIAL2!K52","v":0},0,{"$f":"VLOOKUP(I51,RESERVADO!A$1:B$1001,2)","v":"CERO"}," "]
[null,null,41,{"$f":"IF('AS1'!E45=\"\",\"\",'AS1'!E45)","v":""},{"$f":"PARCIAL1!F53+PARCIAL2!F53","v":0},0,{"$f":"PARCIAL1!K53","v":0},{"$f":"PARCIAL2!K53","v":0},0,{"$f":"VLOOKUP(I52,RESERVADO!A$1:B$1001,2)","v":"CERO"}," "]
[null,null,42,{"$f":"IF('AS1'!E46=\"\",\"\",'AS1'!E46)","v":""},{"$f":"PARCIAL1!F54+PARCIAL2!F54","v":0},0,{"$f":"PARCIAL1!K54","v":0},{"$f":"PARCIAL2!K54","v":0},0,{"$f":"VLOOKUP(I53,RESERVADO!A$1:B$1001,2)","v":"CERO"}," "]
[null,null,43,{"$f":"IF('AS1'!E47=\"\",\"\",'AS1'!E47)","v":""},{"$f":"PARCIAL1!F55+PARCIAL2!F55","v":0},0,{"$f":"PARCIAL1!K55","v":0},{"$f":"PARCIAL2!K55","v":0},0,{"$f":"VLOOKUP(I54,RESERVADO!A$1:B$1001,2)","v":"CERO"}," "]
[null,null,44,{"$f":"IF('AS1'!E48=\"\",\"\",'AS1'!E48)","v":""},{"$f":"PARCIAL1!F56+PARCIAL2!F56","v":0},0,{"$f":"PARCIAL1!K56","v":0},{"$f":"PARCIAL2!K56","v":0},0,{"$f":"VLOOKUP(I55,RESERVADO!A$1:B$1001,2)","v":"CERO"}," "]
[null,null,45,{"$f":"IF('AS1'!E49=\"\",\"\",'AS1'!E49)","v":""},{"$f":"PARCIAL1!F57+PARCIAL2!F57","v":0},0,{"$f":"PARCIAL1!K57","v":0},{"$f":"PARCIAL2!K57","v":0},0,{"$f":"VLOOKUP(I56,RESERVADO!A$1:B$1001,2)","v":"CERO"}," "]
[null,null,46,{"$f":"IF('AS1'!E50=\"\",\"\",'AS1'!E50)","v":""},{"$f":"PARCIAL1!F58+PARCIAL2!F58","v":0},0,{"$f":"PARCIAL1!K58","v":0},{"$f":"PARCIAL2!K58","v":0},0,{"$f":"VLOOKUP(I57,RESERVADO!A$1:B$1001,2)","v":"CERO"}," "]
[null,null,47,{"$f":"IF('AS1'!E51=\"\",\"\",'AS1'!E51)","v":""},{"$f":"PARCIAL1!F59+PARCIAL2!F59","v":0},0,{"$f":"PARCIAL1!K59","v":0},{"$f":"PARCIAL2!K59","v":0},0,{"$f":"VLOOKUP(I58,RESERVADO!A$1:B$1001,2)","v":"CERO"}," "]
[null,null,48,{"$f":"IF('AS1'!E52=\"\",\"\",'AS1'!E52)","v":""},{"$f":"PARCIAL1!F60+PARCIAL2!F60","v":0},0,{"$f":"PARCIAL1!K60","v":0},{"$f":"PARCIAL2!K60","v":0},0,{"$f":"VLOOKUP(I59,RESERVADO!A$1:B$1001,2)","v":"CERO"}," "]
[null,null,49,{"$f":"IF('AS1'!E53=\"\",\"\",'AS1'!E53)","v":""},{"$f":"PARCIAL1!F61+PARCIAL2!F61","v":0},0,{"$f":"PARCIAL1!K61","v":0},{"$f":"PARCIAL2!K61","v":0},0,{"$f":"VLOOKUP(I60,RESERVADO!A$1:B$1001,2)","v":"CERO"}," "]
[null,null,50,{"$f":"IF('AS1'!E54=\"\",\"\",'AS1'!E54)","v":""},{"$f":"PARCIAL1!F62+PARCIAL2!F62","v":0},0,{"$f":"PARCIAL1!K62","v":0},{"$f":"PARCIAL2!K62","v":0},0,{"$f":"VLOOKUP(I61,RESERVADO!A$1:B$1001,2)","v":"CERO"}," "]
[null,null,51,{"$f":"IF('AS1'!E55=\"\",\"\",'AS1'!E55)","v":""},{"$f":"PARCIAL1!F63+PARCIAL2!F63","v":0},0,{"$f":"PARCIAL1!K63","v":0},{"$f":"PARCIAL2!K63","v":0},0,{"$f":"VLOOKUP(I62,RESERVADO!A$1:B$1001,2)","v":"CERO"}," "]
[null,null,52,{"$f":"IF('AS1'!E56=\"\",\"\",'AS1'!E56)","v":""},{"$f":"PARCIAL1!F64+PARCIAL2!F64","v":0},0,{"$f":"PARCIAL1!K64","v":0},{"$f":"PARCIAL2!K64","v":0},0,{"$f":"VLOOKUP(I63,RESERVADO!A$1:B$1001,2)","v":"CERO"}," "]
[null,null,53,{"$f":"IF('AS1'!E57=\"\",\"\",'AS1'!E57)","v":""},{"$f":"PARCIAL1!F65+PARCIAL2!F65","v":0},0,{"$f":"PARCIAL1!K65","v":0},{"$f":"PARCIAL2!K65","v":0},0,{"$f":"VLOOKUP(I64,RESERVADO!A$1:B$1001,2)","v":"CERO"}," "]
[null,null,54,{"$f":"IF('AS1'!E58=\"\",\"\",'AS1'!E58)","v":""},{"$f":"PARCIAL1!F66+PARCIAL2!F66","v":0},0,{"$f":"PARCIAL1!K66","v":0},{"$f":"PARCIAL2!K66","v":0},0,{"$f":"VLOOKUP(I65,RESERVADO!A$1:B$1001,2)","v":"CERO"}," "]
[null,null,55,{"$f":"IF('AS1'!E59=\"\",\"\",'AS1'!E59)","v":""},{"$f":"PARCIAL1!F67+PARCIAL2!F67","v":0},0,{"$f":"PARCIAL1!K67","v":0},{"$f":"PARCIAL2!K67","v":0},0,{"$f":"VLOOKUP(I66,RESERVADO!A$1:B$1001,2)","v":"CERO"}," "]
[null,null,56,{"$f":"IF('AS1'!E60=\"\",\"\",'AS1'!E60)","v":""},{"$f":"PARCIAL1!F68+PARCIAL2!F68","v":0},0,{"$f":"PARCIAL1!K68","v":0},{"$f":"PARCIAL2!K68","v":0},0,{"$f":"VLOOKUP(I67,RESERVADO!A$1:B$1001,2)","v":"CERO"}," "]
[null,null,57,{"$f":"IF('AS1'!E61=\"\",\"\",'AS1'!E61)","v":""},{"$f":"PARCIAL1!F69+PARCIAL2!F69","v":0},0,{"$f":"PARCIAL1!K69","v":0},{"$f":"PARCIAL2!K69","v":0},0,{"$f":"VLOOKUP(I68,RESERVADO!A$1:B$1001,2)","v":"CERO"}," "]
[null,null,58,{"$f":"IF('AS1'!E62=\"\",\"\",'AS1'!E62)","v":""},{"$f":"PARCIAL1!F70+PARCIAL2!F70","v":0},0,{"$f":"PARCIAL1!K70","v":0},{"$f":"PARCIAL2!K70","v":0},0,{"$f":"VLOOKUP(I69,RESERVADO!A$1:B$1001,2)","v":"CERO"}," "]
[null,null,59,{"$f":"IF('AS1'!E63=\"\",\"\",'AS1'!E63)","v":""},{"$f":"PARCIAL1!F71+PARCIAL2!F71","v":0},0,{"$f":"PARCIAL1!K71","v":0},{"$f":"PARCIAL2!K71","v":0},0,{"$f":"VLOOKUP(I70,RESERVADO!A$1:B$1001,2)","v":"CERO"}," "]
[null,null,60,{"$f":"IF('AS1'!E64=\"\",\"\",'AS1'!E64)","v":""},{"$f":"PARCIAL1!F72+PARCIAL2!F72","v":0},0,{"$f":"PARCIAL1!K72","v":0},{"$f":"PARCIAL2!K72","v":0},0,{"$f":"VLOOKUP(I71,RESERVADO!A$1:B$1001,2)","v":"CERO"}," "]
[null,null,61,{"$f":"IF('AS1'!E65=\"\",\"\",'AS1'!E65)","v":""},{"$f":"PARCIAL1!F73+PARCIAL2!F73","v":0},0,{"$f":"PARCIAL1!K73","v":0},{"$f":"PARCIAL2!K73","v":0},0,{"$f":"VLOOKUP(I72,RESERVADO!A$1:B$1001,2)","v":"CERO"}," "]
[null,null,62,{"$f":"IF('AS1'!E66=\"\",\"\",'AS1'!E66)","v":""},{"$f":"PARCIAL1!F74+PARCIAL2!F74","v":0},0,{"$f":"PARCIAL1!K74","v":0},{"$f":"PARCIAL2!K74","v":0},0,{"$f":"VLOOKUP(I73,RESERVADO!A$1:B$1001,2)","v":"CERO"}," "]
[null,null,63,{"$f":"IF('AS1'!E67=\"\",\"\",'AS1'!E67)","v":""},{"$f":"PARCIAL1!F75+PARCIAL2!F75","v":0},0,{"$f":"PARCIAL1!K75","v":0},{"$f":"PARCIAL2!K75","v":0},0,{"$f":"VLOOKUP(I74,RESERVADO!A$1:B$1001,2)","v":"CERO"}," "]
[null,null,64,{"$f":"IF('AS1'!E68=\"\",\"\",'AS1'!E68)","v":""},{"$f":"PARCIAL1!F76+PARCIAL2!F76","v":0},0,{"$f":"PARCIAL1!K76","v":0},{"$f":"PARCIAL2!K76","v":0},0,{"$f":"VLOOKUP(I75,RESERVADO!A$1:B$1001,2)","v":"CERO"}," "]
[null,null,65,{"$f":"IF('AS1'!E69=\"\",\"\",'AS1'!E69)","v":""},{"$f":"PARCIAL1!F77+PARCIAL2!F77","v":0},0,{"$f":"PARCIAL1!K77","v":0},{"$f":"PARCIAL2!K77","v":0},0,{"$f":"VLOOKUP(I76,RESERVADO!A$1:B$1001,2)","v":"CERO"},{"$f":"IF(D76=\"\",\" \",IF(AND(D76<>\"\",I76=0),\"retirado\",IF(AND(I76>=7,F76>=70%),\"aprobado\",IF(OR(I76<=4.49,F76<70%),\"reprobado\",IF(AND(I76>=5,F76>=70%),\"suspenso\")))))","v":" "}]
[null,null,66,{"$f":"IF('AS1'!E70=\"\",\"\",'AS1'!E70)","v":""},{"$f":"PARCIAL1!F78+PARCIAL2!F78","v":0},{"$f":"IF(K$8=0,0,(E77*100%)/K$8)","v":0},{"$f":"PARCIAL1!K78","v":0},{"$f":"PARCIAL2!K78","v":0},{"$f":"IF(MOD((G77+H77),2)>=1,ROUND((G77+H77)/2,0),ROUND((G77+H77)/2,2))","v":0},{"$f":"VLOOKUP(I77,RESERVADO!A$1:B$1001,2)","v":"CERO"}," "]
[null,null,67,{"$f":"IF('AS1'!E71=\"\",\"\",'AS1'!E71)","v":""},{"$f":"PARCIAL1!F79+PARCIAL2!F79","v":0},0,{"$f":"PARCIAL1!K79","v":0},{"$f":"PARCIAL2!K79","v":0},0,{"$f":"VLOOKUP(I78,RESERVADO!A$1:B$1001,2)","v":"CERO"}," "]
[null,null,68,{"$f":"IF('AS1'!E72=\"\",\"\",'AS1'!E72)","v":""},{"$f":"PARCIAL1!F80+PARCIAL2!F80","v":0},0,{"$f":"PARCIAL1!K80","v":0},{"$f":"PARCIAL2!K80","v":0},0,{"$f":"VLOOKUP(I79,RESERVADO!A$1:B$1001,2)","v":"CERO"}," "]
[null,null,69,{"$f":"IF('AS1'!E73=\"\",\"\",'AS1'!E73)","v":""},{"$f":"PARCIAL1!F81+PARCIAL2!F81","v":0},0,{"$f":"PARCIAL1!K81","v":0},{"$f":"PARCIAL2!K81","v":0},0,{"$f":"VLOOKUP(I80,RESERVADO!A$1:B$1001,2)","v":"CERO"}," "]
[null,null,70,{"$f":"IF('AS1'!E74=\"\",\"\",'AS1'!E74)","v":""},{"$f":"PARCIAL1!F82+PARCIAL2!F82","v":0},0,{"$f":"PARCIAL1!K82","v":0},{"$f":"PARCIAL2!K82","v":0},0,{"$f":"VLOOKUP(I81,RESERVADO!A$1:B$1001,2)","v":"CERO"}," "]

{"sheet":"INFORME ACADEMICO","index":14,"n_rows":67,"n_cols":10,"rows_kept":67,"cut":false,"hidden":true,"merged":[[1,2,1,9],[61,3,61,5],[65,2,65,3],[66,2,66,4],[66,8,66,9],[48,2,48,5],[48,7,48,9],[39,2,39,5],[39,7,39,9],[42,2,43,5],[42,7,43,9],[44,2,44,5],[44,7,44,9],[45,2,45,5],[45,7,45,9],[46,2,46,5],[67,7,67,9],[58,2,58,5],[58,7,58,9],[49,2,49,5],[49,7,49,9],[50,2,50,5],[50,7,50,9],[51,2,51,5],[51,7,51,9],[54,2,55,5],[54,7,55,9],[56,7,56,9],[57,7,57,9],[56,2,56,5],[57,2,57,5],[46,7,46,9],[47,2,47,5],[35,2,36,5],[35,7,36,9],[37,2,37,5],[37,7,37,9],[38,2,38,5],[38,7,38,9],[29,2,30,5],[29,7,29,8],[30,7,30,8],[31,2,32,5],[31,7,31,8],[32,7,32,8],[25,2,26,5],[25,7,25,8],[26,7,26,8],[27,2,28,5],[27,7,27,8],[28,7,28,8],[19,2,19,4],[19,7,19,9],[20,2,20,5],[23,2,24,5],[23,7,23,9],[24,7,24,8],[16,2,16,4],[16,7,16,9],[17,2,17,4],[17,7,17,9],[18,2,18,4],[18,7,18,9],[15,2,15,5],[15,7,15,9],[9,2,9,5],[9,7,9,9],[10,2,10,5],[10,7,10,9],[11,2,11,5],[11,7,11,9],[12,7,12,9],[13,7,13,9],[14,7,14,9],[8,2,8,5],[8,7,8,9],[2,2,2,9],[3,7,3,9],[4,7,4,9],[5,7,5,9],[6,2,6,9]]}
[]
[]
[null,null,"UNIVERSIDAD NACIONAL DE CHIMBORAZO"]
[null,null,null,null,null,null,"FACULTAD DE:",{"$f":"INICIO!D5","v":"Ciencias de la Salud"}]
[null,null,null,null,null,null,"CARRERA DE:",{"$f":"INICIO!D6","v":"Enfermería"}]
[null,null,null,null,null,null,"PERÍODO ACADÉMICO:",{"$f":"INICIO!D7","v":" 2024 -  2025"}]
[null,null,"INFORME ACADÉMICO SEMESTRAL"]
[]
[null,null,"1. DATOS GENERALES",null,null,null,null,"2. COMPETENCIA(S) DEL PERFIL PROFESIONAL A LA QUE APORTA A LA ASIGNATURA"]
[null,null,{"$f":"CONCATENATE(\"Asignatura: \",INICIO!D11)","v":"Asignatura: Enfermería Gíneco oObstétrica II"}]
[null,null,{"$f":"CONCATENATE(\"Semestre: \",INICIO!D8,\" \",INICIO!D9)","v":"Semestre: 6to A"}]
[null,null,{"$f":"CONCATENATE(\"Docente: \",INICIO!D4)","v":"Docente: Graciela Rivera Herrera"}]
[null,null,"Horas asignadas semanal:",0,"Semestral:",{"$f":"D13*16","v":0}]
[null,null,null,null,null,null,null,"Cumplimiento Objetivo (s): (%) 80"]
[]
[null,null,"3. HORAS",null,null,null,null,"4. UNIDADES CURRICULARES DESARROLLADAS"]
[null,null,"Total Horas Asignadas ",null,null,{"$f":"F13","v":0}]
[null,null,"Total Horas Efectivas Dictadas ",null,null,{"$f":"FINAL!K8","v":106}]
[null,null,"Total Horas Justificadas ",null,null,{"$f":"F17-F18","v":-106}]
[null,null,"Total Horas Afectadas*"]
[null,null,"Fuente: Registro Avance academico."]
[]
[]
[null,null,"5. RESULTADOS DE APRENDIZAJE ALCANZADOS",null,null,null,null,"6. RESULTADOS CUANTITATIVOS "]
[null,null,null,null,null,null,null,"Número de Estudiantes según lista",null,{"$f":"ESTADIS!D10","v":8}]
[null,null,null,null,null,null,null,"Número Promedio de estudiantes que asisten regularmente.",null,{"$f":"ESTADIS!C24","v":8}]
[null,null,null,null,null,null,null,"Promedio de Asistencia del Curso %",null,{"$f":"ESTADIS!D13","v":0.8867924528301887}]
[null,null,null,null,null,null,null,"No. de Estudiantes con calificación :",null,{"$f":"ESTADIS!C24","v":8}]
[null,null,null,null,null,null,null,"Mayor o igual a 7 puntos",null,{"$f":"ESTADIS!C21","v":6}]
[null,null,null,null,null,null,null,"Menor a 7 puntos:",null,{"$f":"ESTADIS!C22+ESTADIS!C23","v":2}]
[null,null,null,null,null,null,null,"Número de Estudiantes con dificultades académicas.",null,{"$f":"ESTADIS!C35","v":1}]
[null,null,null,null,null,null,null,"Promedio Global de Rendimiento del Curso",null,{"$f":"ESTADIS!D12","v":6.203333333333334}]
[null,null,null,null,null,null,null,"Cumplimiento del sílabo %"]
[]
[]
[null,null,"7. NOMINA DE ESTUDIANTES CON DIFICULTADES ACADÉMICAS",null,null,null,null,"8. CAUSAS DE DIFICULTADES ACADÉMICAS MANIFESTADAS POR LOS ESTUDIANTES"]
[]
[]
[]
[]
[]
[]
[null,null,"9. ESTRATEGIAS METODOLÓGICAS APLICADAS",null,null,null,null,"10. SITUACIONES DETECTADAS POR EL DOCENTE QUE AFECTAN EL CUMPLIMIENTO DE LA PLANIFICACIÓN MICROCURRICULAR"]
[]
[]
[]
[]
[]
[]
[]
[]
[]
[]
[]
[null,null,"11. ACTIVIDADES DE APOYO PSICOPEDAGÓGICO FRENTE A DIFICULTADES DETECTADAS",null,null,null,null,"12. CONCLUSIONES"]
[]
[null,null,null,null,null,null,null,"1.-"]
[null,null,null,null,null,null,null,"2.-"]
[null,null,"3.-",null,null,null,null,"3.-"]
[]
[]
[null,null,"FECHA DE ENTREGA:",{"$f":"TODAY()","v":"2025-02-14"}]
[]
[]
[]
[]
[null,null,"DOCENTE",null,null,null,null,null,"APROBACIÓN DIRECTOR DE CARRERA"]

{"sheet":"ESTADIS","index":15,"n_rows":36,"n_cols":10,"rows_kept":36,"cut":false,"hidden":true,"merged":[[10,0,10,2],[8,0,8,9],[0,0,0,9],[1,0,1,9],[2,0,2,9],[3,0,3,5],[3,6,3,9],[4,0,4,5],[4,6,4,9],[5,0,5,5],[5,7,5,9],[6,0,6,5],[6,6,6,8],[9,0,9,2],[28,0,28,1],[29,0,29,1],[15,0,15,1],[14,0,14,9],[27,0,27,9]]}
["UNIVERSIDAD NACIONAL DE CHIMBORAZO"]
[{"$f":"CONCATENATE(INICIO!C5,INICIO!D5)","v":"FACULTAD:  Ciencias de la Salud"}]
["DATOS ESTADÍSTICOS DE FIN DE CICLO "]
[{"$f":"CONCATENATE(INICIO!C6,INICIO!D6)","v":"CARRERA: Enfermería"},null,null,null,null,null,{"$f":"CONCATENATE(INICIO!C11,INICIO!D11)","v":"ASIGNATURA: Enfermería Gíneco oObstétrica II"}]
[{"$f":"CONCATENATE(INICIO!C8,INICIO!D8)","v":"SEMESTRE: 6to"},null,null,null,null,null,{"$f":"CONCATENATE(INICIO!C7,INICIO!D7)","v":"PERIODO ACADÉMICO:  2024 -  2025"}]
[{"$f":"CONCATENATE(INICIO!C9,INICIO!D9)","v":"PARALELO: A"},null,null,null,null,null,"PROFESOR:",{"$f":"IF(INICIO!D4=\"\",\"\",INICIO!D4)","v":"Graciela Rivera Herrera"}]
[{"$f":"CONCATENATE(INICIO!C10,INICIO!D10)","v":"ESPECIALIDAD: "},null,null,null,null,null,"NRO. HORAS LABORADAS:",null,null,{"$f":"FINAL!K8","v":106}]
[]
["DATOS GENERALES DEL SEMESTRE"]
["NÚMERO DE ESTUDIANTES MATRICULADOS:",null,null,{"$f":"COUNTIF('AS1'!E5:E74,\"*\")","v":8}]
["NÚMERO DE ESTUDIANTES RETIRADOS:",null,null,{"$f":"COUNTIFS(FINAL!I12:I81,\"=0\",FINAL!D12:D81,\">*\")","v":0}]
[null,null,"PROMEDIO GENERAL:",{"$f":"IF(D10=0,0,AVERAGEIF(FINAL!I12:I81,\">0\"))","v":6.203333333333334}]
[null,null,"ASISTENCIA GENERAL:",{"$f":"IF(D10=0,0,AVERAGEIF(FINAL!F12:F81,\">0\"))","v":0.8867924528301887}]
[]
["ESTADÍSTICAS CALIFICACIONES POR PROMEDIOS"]
[]
[]
[]
[]
[null,"ESTADO DEL ESTUDIANTE","NRO DE ESTUDIANTES","%"]
[null,"PROMEDIO MAYOR IGUAL A 7",{"$f":"COUNTIF(FINAL!I12:I81,\">=7\")","v":6},{"$f":"IF(C$24>0,(C21*100%)/C$24,\" \")","v":0.75}]
[null,"PROMEDIO ENTRE 5 Y 6",{"$f":"COUNTIFS(FINAL!I12:I81,\">=5\",FINAL!I12:I81,\"<7\")","v":1},{"$f":"IF(C$24>0,(C22*100%)/C$24,\" \")","v":0.125}]
[null,"PROMEDIO MENOR QUE 5",{"$f":"(D10-(C21+C22))-D11","v":1},0.125]
[null,"ESTUDIANTES QUE CULMINAN EL SEMESTRE",{"$f":"SUM(C21:C23)","v":8},1]
[]
[]
[]
["ESTADÍSTICAS CALIFICACIONES POR NIVEL DE APROBACIÓN"]
[]
[]
[]
[null,"ESTADO DEL ESTUDIANTE","NRO DE ESTUDIANTES","%"]
[null,"APROBADOS",{"$f":"COUNTIF(FINAL!K12:K81,\"APROBADO\")","v":6},{"$f":"IF(C$36>0,(C33*100%)/C$36,\"\")","v":0.75}]
[null,"SUSPENSOS ",{"$f":"COUNTIF(FINAL!K12:K81,\"SUSPENSO\")","v":1},{"$f":"IF(C$36>0,(C34*100%)/C$36,\"\")","v":0.125}]
[null,"REPROBADOS",{"$f":"COUNTIF(FINAL!K13:K82,\"reprobado\")","v":1},0.125]
[null,"TOTAL",{"$f":"SUM(C33:C35)","v":8},1]

{"sheet":"Hoja1","index":16,"n_rows":19,"n_cols":45,"rows_kept":19,"cut":false,"hidden":true,"merged":[[18,3,18,6],[18,7,18,10],[19,3,19,6],[19,7,19,10],[18,11,18,14],[18,15,18,18],[18,19,18,22],[18,23,18,26],[16,29,16,30],[15,3,15,4],[15,5,15,6],[16,39,16,42],[15,33,15,35],[15,36,15,38],[15,39,15,42],[16,3,16,4],[16,5,16,6],[16,7,16,8],[16,9,16,10],[16,11,16,12],[16,13,16,14],[16,15,16,16],[16,17,16,18],[16,19,16,20],[16,21,16,22],[16,23,16,24],[16,25,16,26],[16,27,16,28],[15,29,15,30],[15,31,15,32],[15,7,15,8],[15,9,15,10],[16,33,16,35],[16,36,16,38],[15,11,15,12],[15,13,15,14],[15,15,15,16],[15,17,15,18],[15,19,15,20],[15,21,15,22],[15,23,15,24],[15,25,15,26],[15,27,15,28],[1,3,1,14],[5,2,5,44],[4,2,4,44],[10,27,10,28],[10,29,10,30],[8,2,8,42],[10,33,10,35],[10,36,10,38],[9,3,9,4],[9,33,9,35],[9,36,9,38],[10,3,10,4],[10,5,10,6],[10,7,10,8],[10,9,10,10],[10,11,10,12],[10,13,10,14],[10,15,10,16],[10,17,10,18],[10,19,10,20],[10,21,10,22],[9,5,9,6],[10,23,10,24],[10,25,10,26],[11,2,11,42],[12,3,12,4],[12,5,12,6],[19,39,19,42],[9,39,9,42],[10,39,10,42],[10,31,10,32],[18,33,18,34],[18,35,18,38],[18,39,18,42],[12,7,12,8],[12,9,12,10],[12,11,12,12],[12,13,12,14],[13,11,13,12],[13,13,13,14],[13,15,13,16],[13,17,13,18],[13,19,13,20],[13,3,13,4],[13,5,13,6],[13,7,13,8],[13,9,13,10],[16,31,16,32],[9,31,9,32],[9,29,9,30],[9,7,9,8],[9,9,9,10],[9,11,9,12],[9,13,9,14],[9,15,9,16],[9,17,9,18],[9,19,9,20],[9,21,9,22],[9,23,9,24],[9,25,9,26],[9,27,9,28],[13,39,13,42],[12,33,12,35],[12,36,12,38],[12,39,12,42],[12,25,12,26],[12,27,12,28],[12,29,12,30],[12,31,12,32],[14,2,14,42],[12,21,12,22],[12,23,12,24],[13,29,13,30],[13,31,13,32],[12,15,12,16],[12,17,12,18],[12,19,12,20],[13,21,13,22],[13,23,13,24],[13,25,13,26],[13,27,13,28],[13,33,13,35],[13,36,13,38],[18,43,18,46],[19,11,19,12],[19,13,19,14],[19,15,19,16],[18,27,18,28],[18,29,18,30],[18,31,18,32],[19,43,19,46],[19,17,19,18],[19,19,19,20],[19,21,19,22],[19,23,19,24],[19,25,19,26],[19,27,19,28],[19,29,19,30],[19,31,19,32],[19,33,19,34],[19,35,19,38]]}
[null,null,null,2,null,3,null,4,null,5,null,6,null,7,null,8,null,9,null,10,null,11,null,12,null,13,null,14,null,15,null,16,null,17,null,18,null,19,null,20,null,21,null,22]
[null,null,"INGRESE SU NÚMERO DE CEDULA",1805176326]
[null,null,"APELLIDOS Y NOMBRES",null,null,null,null,null,{"$f":"VLOOKUP($D$2,'AS1'!$D$5:$BG$74,2,FALSE)","v":{"$error":"#N/A"}}]
[]
[null,null,"P R I M E R   P A R C I A L"]
[null,null,"ASISTENCIAS REGISTRADAS EN EL PRIMER PARCIAL"]
[null,null,"FECHA DE CLASE TABAJADA",{"$f":"'AS1'!F4","v":"2024-10-01"},{"$f":"'AS1'!G4","v":"2024-10-02"},{"$f":"'AS1'!H4","v":"2024-10-03"},{"$f":"'AS1'!I4","v":"2024-10-08"},{"$f":"'AS1'!J4","v":"2024-10-09"},{"$f":"'AS1'!K4","v":"2024-10-10"},{"$f":"'AS1'!L4","v":"2024-10-15"},{"$f":"'AS1'!M4","v":"2024-10-16"},{"$f":"'AS1'!N4","v":"2024-10-17"},{"$f":"'AS1'!O4","v":"2024-10-22"},{"$f":"'AS1'!P4","v":"2024-10-23"},{"$f":"'AS1'!Q4","v":"2024-10-24"},{"$f":"'AS1'!R4","v":"2024-10-29"},{"$f":"'AS1'!S4","v":"2024-10-30"},{"$f":"'AS1'!T4","v":"2024-10-31"},{"$f":"'AS1'!U4","v":"2024-11-05"},{"$f":"'AS1'!V4","v":"2024-11-06"},{"$f":"'AS1'!W4","v":"2024-11-07"},{"$f":"'AS1'!X4","v":"2024-11-12"},{"$f":"'AS1'!Y4","v":"2024-11-13"},{"$f":"'AS1'!Z4","v":"2024-11-14"},{"$f":"'AS1'!AA4","v":"2024-11-19"},{"$f":"'AS1'!AB4","v":"2024-11-20"},{"$f":"'AS1'!AC4","v":"2024-11-21"},{"$f":"'AS1'!AD4","v":"2024-11-26"},{"$f":"'AS1'!AE4","v":"2024-11-27"},{"$f":"'AS1'!AF4","v":"2024-11-28"},{"$f":"'AS1'!AG4","v":"00:00:00"},{"$f":"'AS1'!AH4","v":"00:00:00"},{"$f":"'AS1'!AI4","v":"00:00:00"},{"$f":"'AS1'!AJ4","v":"00:00:00"},{"$f":"'AS1'!AK4","v":"00:00:00"},{"$f":"'AS1'!AL4","v":"00:00:00"},{"$f":"'AS1'!AM4","v":"00:00:00"},{"$f":"'AS1'!AN4","v":"00:00:00"},{"$f":"'AS1'!AO4","v":"00:00:00"},{"$f":"'AS1'!AP4","v":"00:00:00"},{"$f":"'AS1'!AQ4","v":"00:00:00"},{"$f":"'AS1'!AR4","v":"00:00:00"},{"$f":"'AS1'!AS4","v":"00:00:00"},{"$f":"'AS1'!AT4","v":"00:00:00"},"TOTAL HORAS ASISTIDAS"]
[null,null,"SU ASISTENCIA",{"$f":"VLOOKUP($D$2,'AS1'!$D$5:$BG$74,3,FALSE)","v":{"$error":"#N/A"}},{"$f":"VLOOKUP($D$2,'AS1'!$D$5:$BG$74,4,FALSE)","v":{"$error":"#N/A"}},{"$f":"VLOOKUP($D$2,'AS1'!$D$5:$BG$74,5,FALSE)","v":{"$error":"#N/A"}},{"$f":"VLOOKUP($D$2,'AS1'!$D$5:$BG$74,6,FALSE)","v":{"$error":"#N/A"}},{"$f":"VLOOKUP($D$2,'AS1'!$D$5:$BG$74,7,FALSE)","v":{"$error":"#N/A"}},{"$f":"VLOOKUP($D$2,'AS1'!$D$5:$BG$74,8,FALSE)","v":{"$error":"#N/A"}},{"$f":"VLOOKUP($D$2,'AS1'!$D$5:$BG$74,9,FALSE)","v":{"$error":"#N/A"}},{"$f":"VLOOKUP($D$2,'AS1'!$D$5:$BG$74,10,FALSE)","v":{"$error":"#N/A"}},{"$f":"VLOOKUP($D$2,'AS1'!$D$5:$BG$74,11,FALSE)","v":{"$error":"#N/A"}},{"$f":"VLOOKUP($D$2,'AS1'!$D$5:$BG$74,12,FALSE)","v":{"$error":"#N/A"}},{"$f":"VLOOKUP($D$2,'AS1'!$D$5:$BG$74,13,FALSE)","v":{"$error":"#N/A"}},{"$f":"VLOOKUP($D$2,'AS1'!$D$5:$BG$74,14,FALSE)","v":{"$error":"#N/A"}},{"$f":"VLOOKUP($D$2,'AS1'!$D$5:$BG$74,15,FALSE)","v":{"$error":"#N/A"}},{"$f":"VLOOKUP($D$2,'AS1'!$D$5:$BG$74,16,FALSE)","v":{"$error":"#N/A"}},{"$f":"VLOOKUP($D$2,'AS1'!$D$5:$BG$74,17,FALSE)","v":{"$error":"#N/A"}},{"$f":"VLOOKUP($D$2,'AS1'!$D$5:$BG$74,18,FALSE)","v":{"$error":"#N/A"}},{"$f":"VLOOKUP($D$2,'AS1'!$D$5:$BG$74,19,FALSE)","v":{"$error":"#N/A"}},{"$f":"VLOOKUP($D$2,'AS1'!$D$5:$BG$74,20,FALSE)","v":{"$error":"#N/A"}},{"$f":"VLOOKUP($D$2,'AS1'!$D$5:$BG$74,21,FALSE)","v":{"$error":"#N/A"}},{"$f":"VLOOKUP($D$2,'AS1'!$D$5:$BG$74,22,FALSE)","v":{"$error":"#N/A"}},{"$f":"VLOOKUP($D$2,'AS1'!$D$5:$BG$74,23,FALSE)","v":{"$error":"#N/A"}},{"$f":"VLOOKUP($D$2,'AS1'!$D$5:$BG$74,24,FALSE)","v":{"$error":"#N/A"}},{"$f":"VLOOKUP($D$2,'AS1'!$D$5:$BG$74,25,FALSE)","v":{"$error":"#N/A"}},{"$f":"VLOOKUP($D$2,'AS1'!$D$5:$BG$74,26,FALSE)","v":{"$error":"#N/A"}},{"$f":"VLOOKUP($D$2,'AS1'!$D$5:$BG$74,27,FALSE)","v":{"$error":"#N/A"}},{"$f":"VLOOKUP($D$2,'AS1'!$D$5:$BG$74,28,FALSE)","v":{"$error":"#N/A"}},{"$f":"VLOOKUP($D$2,'AS1'!$D$5:$BG$74,29,FALSE)","v":{"$error":"#N/A"}},{"$f":"VLOOKUP($D$2,'AS1'!$D$5:$BG$74,30,FALSE)","v":{"$error":"#N/A"}},{"$f":"VLOOKUP($D$2,'AS1'!$D$5:$BG$74,31,FALSE)","v":{"$error":"#N/A"}},{"$f":"VLOOKUP($D$2,'AS1'!$D$5:$BG$74,32,FALSE)","v":{"$error":"#N/A"}},{"$f":"VLOOKUP($D$2,'AS1'!$D$5:$BG$74,33,FALSE)","v":{"$error":"#N/A"}},{"$f":"VLOOKUP($D$2,'AS1'!$D$5:$BG$74,34,FALSE)","v":{"$error":"#N/A"}},{"$f":"VLOOKUP($D$2,'AS1'!$D$5:$BG$74,35,FALSE)","v":{"$error":"#N/A"}},{"$f":"VLOOKUP($D$2,'AS1'!$D$5:$BG$74,36,FALSE)","v":{"$error":"#N/A"}},{"$f":"VLOOKUP($D$2,'AS1'!$D$5:$BG$74,37,FALSE)","v":{"$error":"#N/A"}},{"$f":"VLOOKUP($D$2,'AS1'!$D$5:$BG$74,38,FALSE)","v":{"$error":"#N/A"}},{"$f":"VLOOKUP($D$2,'AS1'!$D$5:$BG$74,39,FALSE)","v":{"$error":"#N/A"}},{"$f":"VLOOKUP($D$2,'AS1'!$D$5:$BG$74,40,FALSE)","v":{"$error":"#N/A"}},{"$f":"VLOOKUP($D$2,'AS1'!$D$5:$BG$74,41,FALSE)","v":{"$error":"#N/A"}},{"$f":"VLOOKUP($D$2,'AS1'!$D$5:$BG$74,42,FALSE)","v":{"$error":"#N/A"}},{"$f":"VLOOKUP($D$2,'AS1'!$D$5:$BG$74,43,FALSE)","v":{"$error":"#N/A"}},{"$f":"VLOOKUP($D$2,'AS1'!$D$5:$BG$74,55,FALSE)","v":{"$error":"#N/A"}}]
[null,null,"DOCENCIA: ASISTIDO POR EL PROFESOR Y ACTIVIDADES DE APRENDIZAJE COLABORATIVO - PRIMER PARCIAL"]
[null,null,"ACTIVIDAD REA LIZADA ",{"$f":"'DOC1'!F5","v":"Parcial I"},null,{"$f":"'DOC1'!G5","v":"EXPOSICIÓN Inducción - conducción 10/10/24"},null,{"$f":"'DOC1'!H5","v":"EXPOSICIÓN\nDolor del parto y estrategias"},null,{"$f":"'DOC1'!I5","v":"EXPOSICIÓN Puerperio 29/10/24  - 5-6-7/11/24 "},null,{"$f":"'DOC1'!J5","v":"PARTICIPACIÓN"},null,{"$f":"'DOC1'!K5","v":"EXPOSICIÓN Trast. H del E. 12-13-14/11/24 "},null,{"$f":"'DOC1'!L5","v":"LECCIÓN 14/11/24 "},null,{"$f":"'DOC1'!M5","v":"EXPOSICIÓN Alto Riesgo Obst. 19/11/24"},null,{"$f":"'DOC1'!N5","v":"EXPOSICIÓN Pruebas Prenatales y valoración en el embarazo de  ARO 21-26/11/24"},null,{"$f":"'DOC1'!O5","v":0},null,{"$f":"'DOC1'!#REF!","v":{"$error":"#REF!"}},null,{"$f":"'DOC1'!#REF!","v":{"$error":"#REF!"}},null,{"$f":"'DOC1'!#REF!","v":{"$error":"#REF!"}},null,{"$f":"'DOC1'!#REF!","v":{"$error":"#REF!"}},null,{"$f":"'DOC1'!#REF!","v":{"$error":"#REF!"}},null,"SUMA",null,null,"PROMEDIO sobre 10",null,null,"EQUIVALENCIA sobre 4"]
[null,null,"CALIFICACION OBTENIDA",{"$f":"VLOOKUP($D$2,'DOC1'!$D$6:$R$75,F1,FALSE)","v":{"$error":"#N/A"}},null,{"$f":"VLOOKUP($D$2,'DOC1'!$D$6:$R$75,H1,FALSE)","v":{"$error":"#N/A"}},null,{"$f":"VLOOKUP($D$2,'DOC1'!$D$6:$R$75,J1,FALSE)","v":{"$error":"#N/A"}},null,{"$f":"VLOOKUP($D$2,'DOC1'!$D$6:$R$75,L1,FALSE)","v":{"$error":"#N/A"}},null,{"$f":"VLOOKUP($D$2,'DOC1'!$D$6:$R$75,N1,FALSE)","v":{"$error":"#N/A"}},null,{"$f":"VLOOKUP($D$2,'DOC1'!$D$6:$R$75,P1,FALSE)","v":{"$error":"#N/A"}},null,{"$f":"VLOOKUP($D$2,'DOC1'!$D$6:$R$75,R1,FALSE)","v":{"$error":"#N/A"}},null,{"$f":"VLOOKUP($D$2,'DOC1'!$D$6:$R$75,T1,FALSE)","v":{"$error":"#N/A"}},null,{"$f":"VLOOKUP($D$2,'DOC1'!$D$6:$R$75,V1,FALSE)","v":{"$error":"#N/A"}},null,{"$f":"VLOOKUP($D$2,'DOC1'!$D$6:$R$75,X1,FALSE)","v":{"$error":"#N/A"}},null,{"$f":"VLOOKUP($D$2,'DOC1'!$D$6:$R$75,Z1,FALSE)","v":{"$error":"#N/A"}},null,{"$f":"VLOOKUP($D$2,'DOC1'!$D$6:$R$75,AB1,FALSE)","v":{"$error":"#N/A"}},null,{"$f":"VLOOKUP($D$2,'DOC1'!$D$6:$R$75,AD1,FALSE)","v":{"$error":"#N/A"}},null,{"$f":"VLOOKUP($D$2,'DOC1'!$D$6:$R$75,AF1,FALSE)","v":{"$error":"#N/A"}},null,{"$f":"VLOOKUP($D$2,'DOC1'!$D$6:$R$75,AH1,FALSE)","v":{"$error":"#N/A"}},null,{"$f":"VLOOKUP($D$2,'DOC1'!$D$6:$R$75,18,FALSE)","v":{"$error":"#N/A"}},null,null,{"$f":"VLOOKUP($D$2,'DOC1'!$D$6:$R$75,19,FALSE)","v":{"$error":"#N/A"}},null,null,{"$f":"VLOOKUP($D$2,'DOC1'!$D$6:$R$75,20,FALSE)","v":{"$error":"#N/A"}}]
[null,null,"PRÁCTICAS DE APLICACIÓN Y EXPERIMENTACIÓN: Diversos entornos de aprendizaje - PRIMER PARCIAL"]
[null,null,"ACTIVIDAD REA LIZADA ",{"$f":"PRAC1!F5","v":"Lic. M. Londo"},null,{"$f":"PRAC1!G5","v":"Graciela Rivera Psicoprofilaxis"},null,{"$f":"PRAC1!H5","v":"Práctica hospitalaria"},null,{"$f":"PRAC1!I5","v":0},null,{"$f":"PRAC1!J5","v":0},null,{"$f":"PRAC1!K5","v":0},null,{"$f":"PRAC1!L5","v":0},null,{"$f":"PRAC1!M5","v":0},null,{"$f":"PRAC1!N5","v":0},null,{"$f":"PRAC1!O5","v":0},null,{"$f":"PRAC1!#REF!","v":{"$error":"#REF!"}},null,{"$f":"PRAC1!#REF!","v":{"$error":"#REF!"}},null,{"$f":"PRAC1!#REF!","v":{"$error":"#REF!"}},null,{"$f":"PRAC1!#REF!","v":{"$error":"#REF!"}},null,{"$f":"PRAC1!#REF!","v":{"$error":"#REF!"}},null,"SUMA",null,null,"PROMEDIO sobre 10",null,null,"EQUIVALENCIA sobre 4"]
[null,null,"CALIFICACION OBTENIDA",{"$f":"VLOOKUP($D$2,PRAC1!$D$6:$R$75,F1,FALSE)","v":{"$error":"#N/A"}},null,{"$f":"VLOOKUP($D$2,PRAC1!$D$6:$R$75,H1,FALSE)","v":{"$error":"#N/A"}},null,{"$f":"VLOOKUP($D$2,PRAC1!$D$6:$R$75,J1,FALSE)","v":{"$error":"#N/A"}},null,{"$f":"VLOOKUP($D$2,PRAC1!$D$6:$R$75,L1,FALSE)","v":{"$error":"#N/A"}},null,{"$f":"VLOOKUP($D$2,PRAC1!$D$6:$R$75,N1,FALSE)","v":{"$error":"#N/A"}},null,{"$f":"VLOOKUP($D$2,PRAC1!$D$6:$R$75,P1,FALSE)","v":{"$error":"#N/A"}},null,{"$f":"VLOOKUP($D$2,PRAC1!$D$6:$R$75,R1,FALSE)","v":{"$error":"#N/A"}},null,{"$f":"VLOOKUP($D$2,PRAC1!$D$6:$R$75,T1,FALSE)","v":{"$error":"#N/A"}},null,{"$f":"VLOOKUP($D$2,PRAC1!$D$6:$R$75,V1,FALSE)","v":{"$error":"#N/A"}},null,{"$f":"VLOOKUP($D$2,PRAC1!$D$6:$R$75,X1,FALSE)","v":{"$error":"#N/A"}},null,{"$f":"VLOOKUP($D$2,PRAC1!$D$6:$R$75,Z1,FALSE)","v":{"$error":"#N/A"}},null,{"$f":"VLOOKUP($D$2,PRAC1!$D$6:$R$75,AB1,FALSE)","v":{"$error":"#N/A"}},null,{"$f":"VLOOKUP($D$2,PRAC1!$D$6:$R$75,AD1,FALSE)","v":{"$error":"#N/A"}},null,{"$f":"VLOOKUP($D$2,PRAC1!$D$6:$R$75,AF1,FALSE)","v":{"$error":"#N/A"}},null,{"$f":"VLOOKUP($D$2,PRAC1!$D$6:$R$75,AH1,FALSE)","v":{"$error":"#N/A"}},null,{"$f":"VLOOKUP($D$2,PRAC1!$D$6:$R$75,18,FALSE)","v":{"$error":"#N/A"}},null,null,{"$f":"VLOOKUP($D$2,PRAC1!$D$6:$R$75,19,FALSE)","v":{"$error":"#N/A"}},null,null,{"$f":"VLOOKUP($D$2,PRAC1!$D$6:$R$75,20,FALSE)","v":{"$error":"#N/A"}}]
[null,null,"PRÁCTICAS DE APLICACIÓN Y EXPERIMENTACIÓN: Diversos entornos de aprendizaje - PRIMER PARCIAL"]
[null,null,"ACTIVIDAD REA LIZADA ",{"$f":"'AUT1'!F5","v":"EXPOSICIÓN Proceso del parto 15-17-24/10/24 Monitorización de la FCF Variaciones   de la FCF 22/10/24"},null,{"$f":"'AUT1'!G5","v":0},null,{"$f":"'AUT1'!H5","v":0},null,{"$f":"'AUT1'!I5","v":0},null,{"$f":"'AUT1'!J5","v":0},null,{"$f":"'AUT1'!K5","v":0},null,{"$f":"'AUT1'!L5","v":0},null,{"$f":"'AUT1'!M5","v":0},null,{"$f":"'AUT1'!N5","v":0},null,{"$f":"'AUT1'!O5","v":0},null,{"$f":"'AUT1'!#REF!","v":{"$error":"#REF!"}},null,{"$f":"'AUT1'!#REF!","v":{"$error":"#REF!"}},null,{"$f":"'AUT1'!#REF!","v":{"$error":"#REF!"}},null,{"$f":"'AUT1'!#REF!","v":{"$error":"#REF!"}},null,{"$f":"'AUT1'!#REF!","v":{"$error":"#REF!"}},null,"SUMA",null,null,"PROMEDIO sobre 10",null,null,"EQUIVALENCIA sobre 4"]
[null,null,"CALIFICACION OBTENIDA",{"$f":"VLOOKUP($D$2,'AUT1'!$D$6:$R$75,F1,FALSE)","v":{"$error":"#N/A"}},null,{"$f":"VLOOKUP($D$2,'AUT1'!$D$6:$R$75,H1,FALSE)","v":{"$error":"#N/A"}},null,{"$f":"VLOOKUP($D$2,'AUT1'!$D$6:$R$75,J1,FALSE)","v":{"$error":"#N/A"}},null,{"$f":"VLOOKUP($D$2,'AUT1'!$D$6:$R$75,L1,FALSE)","v":{"$error":"#N/A"}},null,{"$f":"VLOOKUP($D$2,'AUT1'!$D$6:$R$75,N1,FALSE)","v":{"$error":"#N/A"}},null,{"$f":"VLOOKUP($D$2,'AUT1'!$D$6:$R$75,P1,FALSE)","v":{"$error":"#N/A"}},null,{"$f":"VLOOKUP($D$2,'AUT1'!$D$6:$R$75,R1,FALSE)","v":{"$error":"#N/A"}},null,{"$f":"VLOOKUP($D$2,'AUT1'!$D$6:$R$75,T1,FALSE)","v":{"$error":"#N/A"}},null,{"$f":"VLOOKUP($D$2,'AUT1'!$D$6:$R$75,V1,FALSE)","v":{"$error":"#N/A"}},null,{"$f":"VLOOKUP($D$2,'AUT1'!$D$6:$R$75,X1,FALSE)","v":{"$error":"#N/A"}},null,{"$f":"VLOOKUP($D$2,'AUT1'!$D$6:$R$75,Z1,FALSE)","v":{"$error":"#N/A"}},null,{"$f":"VLOOKUP($D$2,'AUT1'!$D$6:$R$75,AB1,FALSE)","v":{"$error":"#N/A"}},null,{"$f":"VLOOKUP($D$2,'AUT1'!$D$6:$R$75,AD1,FALSE)","v":{"$error":"#N/A"}},null,{"$f":"VLOOKUP($D$2,'AUT1'!$D$6:$R$75,AF1,FALSE)","v":{"$error":"#N/A"}},null,{"$f":"VLOOKUP($D$2,'AUT1'!$D$6:$R$75,AH1,FALSE)","v":{"$error":"#N/A"}},null,{"$f":"VLOOKUP($D$2,'AUT1'!$D$6:$R$75,18,FALSE)","v":{"$error":"#N/A"}},null,null,{"$f":"VLOOKUP($D$2,'AUT1'!$D$6:$R$75,19,FALSE)","v":{"$error":"#N/A"}},null,null,{"$f":"VLOOKUP($D$2,'AUT1'!$D$6:$R$75,20,FALSE)","v":{"$error":"#N/A"}}]
[]
[null,null,null,"ASISTENCIA",null,null,null,"PORCENTA",null,null,null,"DOCENCIA",null,null,null,"PRACTICAS",null,null,null,"AUTONOMO",null,null,null,"PROMEDIO"]

{"sheet":"RESERVADO","index":17,"n_rows":1001,"n_cols":2,"rows_kept":1001,"cut":false,"hidden":true,"merged":[]}
[0,"CERO"]
[0.01,"CERO.CERO UNO"]
[0.02,"CERO.CERO DOS"]
[0.03,"CERO.CERO TRES"]
[0.04,"CERO.CERO CUATRO"]
[0.05,"CERO.CERO CINCO"]
[0.06,"CERO.CERO SEIS"]
[7.0000000000000007E-2,"CERO.CERO SIETE"]
[0.08,"CERO.CERO OCHO"]
[0.09,"CERO.CERO NUEVE"]
[0.1,"CERO.DIEZ"]
[0.11,"CERO.ONCE"]
[0.12,"CERO.DOCE"]
[0.13,"CERO.TRECE"]
[0.14000000000000001,"CERO.CATORCE"]
[0.15,"CERO.QUINCE"]
[0.16,"CERO.DIECISEIS"]
[0.17,"CERO.DIECISIETE"]
[0.18,"CERO.DIECIOCHO"]
[0.19,"CERO.DIECINUEVE"]
[0.2,"CERO.VEINTE"]
[0.21,"CERO.VEINTEYUNO"]
[0.22,"CERO.VEINTEYDOS"]
[0.23,"CERO.VEINTEYTRES"]
[0.24,"CERO.VEINTEYCUATRO"]
[0.25,"CERO.VEINTEYCINCO"]
[0.26,"CERO.VEINTEYSEIS"]
[0.27,"CERO.VEINTEYSIETE"]
[0.28000000000000003,"CERO.VEINTEYOCHO"]
[0.28999999999999998,"CERO.VEINTEYNUEVE"]
[0.3,"CERO.TREINTA"]
[0.31,"CERO.TREINTAYUNO"]
[0.32,"CERO.TREINTAYDOS"]
[0.33,"CERO.TREINTAYTRES"]
[0.34,"CERO.TREINTAYCUATRO"]
[0.35,"CERO.TREINTAYCINCO"]
[0.36,"CERO.TREINTAYSEIS"]
[0.37,"CERO.TREINTAYSIETE"]
[0.38,"CERO.TREINTAYOCHO"]
[0.39,"CERO.TREINTAYNUEVE"]
[0.4,"CERO.CUARENTA"]
[0.41,"CERO.CUARENTAYUNO"]
[0.42,"CERO.CUARENTAYDOS"]
[0.43,"CERO.CUARENTAYTRES"]
[0.44,"CERO.CUARENTAYCUATRO"]
[0.45,"CERO.CUARENTAYCINCO"]
[0.46,"CERO.CUARENTAYSEIS"]
[0.47,"CERO.CUARENTAYSIETE"]
[0.48,"CERO.CUARENTAYOCHO"]
[0.49,"CERO.CUARENTAYNUEVE"]
[0.5,"CERO.CINCUENTA"]
[0.51,"CERO.CINCUENTAYUNO"]
[0.52,"CERO.CINCUENTAYDOS"]
[0.53,"CERO.CINCUENTAYTRES"]
[0.54,"CERO.CINCUENTAYCUATRO"]
[0.55000000000000004,"CERO.CINCUENTAYCINCO"]
[0.56000000000000005,"CERO.CINCUENTAYSEIS"]
[0.56999999999999995,"CERO.CINCUENTAYSIETE"]
[0.57999999999999996,"CERO.CINCUENTAYOCHO"]
[0.59,"CERO.CINCUENTAYNUEVE"]
[0.6,"CERO.SESENTA"]
[0.61,"CERO.SESENTAYUNO"]
[0.62,"CERO.SESENTAYDOS"]
[0.63,"CERO.SESENTAYTRES"]
[0.64,"CERO.SESENTAYCUATRO"]
[0.65,"CERO.SESENTAYCINCO"]
[0.66,"CERO.SESENTAYSEIS"]
[0.67,"CERO.SESENTAYSIETE"]
[0.68,"CERO.SESENTAYOCHO"]
[0.69,"CERO.SESENTAYNUEVE"]
[0.7,"CERO.SETENTA"]
[0.71,"CERO.SETENTAYUNO"]
[0.72,"CERO.SETENTAYDOS"]
[0.73,"CERO.SETENTAYTRES"]
[0.74,"CERO.SETENTAYCUATRO"]
[0.75,"CERO.SETENTAYCINCO"]
[0.76,"CERO.SETENTAYSEIS"]
[0.77,"CERO.SETENTAYSIETE"]
[0.78,"CERO.SETENTAYOCHO"]
[0.79,"CERO.SETENTAYNUEVE"]
[0.8,"CERO.OCHENTA"]
[0.81,"CERO.OCHENTAYUNO"]
[0.82,"CERO.OCHENTAYDOS"]
[0.83,"CERO.OCHENTAYTRES"]
[0.84,"CERO.OCHENTAYCUATRO"]
[0.85,"CERO.OCHENTAYCINCO"]
[0.86,"CERO.OCHENTAYSEIS"]
[0.87,"CERO.OCHENTAYSIETE"]
[0.88,"CERO.OCHENTAYOCHO"]
[0.89,"CERO.OCHENTAYNUEVE"]
[0.9,"CERO.NOVENTA"]
[0.91,"CERO.NOVENTAYUNO"]
[0.92,"CERO.NOVENTAYDOS"]
[0.93,"CERO.NOVENTAYTRES"]
[0.94,"CERO.NOVENTAYCUATRO"]
[0.95,"CERO.NOVENTAYCINCO"]
[0.96,"CERO.NOVENTAYSEIS"]
[0.97,"CERO.NOVENTAYSIETE"]
[0.98,"CERO.NOVENTAYOCHO"]
[0.99,"CERO.NOVENTAYNUEVE"]
[1,"UNO"]
[1.01,"UNO.CERO UNO"]
[1.02,"UNO.CERO DOS"]
[1.03,"UNO.CERO TRES"]
[1.04,"UNO.CERO CUATRO"]
[1.05,"UNO.CERO CINCO"]
[1.06,"UNO.CERO SEIS"]
[1.07,"UNO.CERO SIETE"]
[1.08,"UNO.CERO OCHO"]
[1.0900000000000001,"UNO.CERO NUEVE"]
[1.1000000000000001,"UNO.DIEZ"]
[1.1100000000000001,"UNO.ONCE"]
[1.1200000000000001,"UNO.DOCE"]
[1.1299999999999999,"UNO.TRECE"]
[1.1399999999999999,"UNO.CATORCE"]
[1.1499999999999999,"UNO.QUINCE"]
[1.1599999999999999,"UNO.DIECISEIS"]
[1.17,"UNO.DIECISIETE"]
[1.18,"UNO.DIECIOCHO"]
[1.19,"UNO.DIECINUEVE"]
[1.2,"UNO.VEINTE"]
[1.21,"UNO.VEINTEYUNO"]
[1.22,"UNO.VEINTEYDOS"]
[1.23,"UNO.VEINTEYTRES"]
[1.24,"UNO.VEINTEYCUATRO"]
[1.25,"UNO.VEINTEYCINCO"]
[1.26,"UNO.VEINTEYSEIS"]
[1.27,"UNO.VEINTEYSIETE"]
[1.28,"UNO.VEINTEYOCHO"]
[1.29,"UNO.VEINTEYNUEVE"]
[1.3,"UNO.TREINTA"]
[1.31,"UNO.TREINTAYUNO"]
[1.32,"UNO.TREINTAYDOS"]
[1.33,"UNO.TREINTAYTRES"]
[1.34,"UNO.TREINTAYCUATRO"]
[1.35,"UNO.TREINTAYCINCO"]
[1.36,"UNO.TREINTAYSEIS"]
[1.37,"UNO.TREINTAYSIETE"]
[1.38,"UNO.TREINTAYOCHO"]
[1.39,"UNO.TREINTAYNUEVE"]
[1.4,"UNO.CUARENTA"]
[1.41,"UNO.CUARENTAYUNO"]
[1.42,"UNO.CUARENTAYDOS"]
[1.43,"UNO.CUARENTAYTRES"]
[1.44,"UNO.CUARENTAYCUATRO"]
[1.45,"UNO.CUARENTAYCINCO"]
[1.46,"UNO.CUARENTAYSEIS"]
[1.47,"UNO.CUARENTAYSIETE"]
[1.48,"UNO.CUARENTAYOCHO"]
[1.49,"UNO.CUARENTAYNUEVE"]
[1.5,"UNO.CINCUENTA"]
[1.51,"UNO.CINCUENTAYUNO"]
[1.52,"UNO.CINCUENTAYDOS"]
[1.53,"UNO.CINCUENTAYTRES"]
[1.54,"UNO.CINCUENTAYCUATRO"]
[1.55,"UNO.CINCUENTAYCINCO"]
[1.56,"UNO.CINCUENTAYSEIS"]
[1.57,"UNO.CINCUENTAYSIETE"]
[1.58,"UNO.CINCUENTAYOCHO"]
[1.59,"UNO.CINCUENTAYNUEVE"]
[1.6,"UNO.SESENTA"]
[1.61,"UNO.SESENTAYUNO"]
[1.62,"UNO.SESENTAYDOS"]
[1.63,"UNO.SESENTAYTRES"]
[1.64,"UNO.SESENTAYCUATRO"]
[1.65,"UNO.SESENTAYCINCO"]
[1.66,"UNO.SESENTAYSEIS"]
[1.67,"UNO.SESENTAYSIETE"]
[1.68,"UNO.SESENTAYOCHO"]
[1.69,"UNO.SESENTAYNUEVE"]
[1.7,"UNO.SETENTA"]
[1.71,"UNO.SETENTAYUNO"]
[1.72,"UNO.SETENTAYDOS"]
[1.73,"UNO.SETENTAYTRES"]
[1.74,"UNO.SETENTAYCUATRO"]
[1.75,"UNO.SETENTAYCINCO"]
[1.76,"UNO.SETENTAYSEIS"]
[1.77,"UNO.SETENTAYSIETE"]
[1.78,"UNO.SETENTAYOCHO"]
[1.79,"UNO.SETENTAYNUEVE"]
[1.8,"UNO.OCHENTA"]
[1.81,"UNO.OCHENTAYUNO"]
[1.82,"UNO.OCHENTAYDOS"]
[1.83,"UNO.OCHENTAYTRES"]
[1.84,"UNO.OCHENTAYCUATRO"]
[1.85,"UNO.OCHENTAYCINCO"]
[1.86,"UNO.OCHENTAYSEIS"]
[1.87,"UNO.OCHENTAYSIETE"]
[1.88,"UNO.OCHENTAYOCHO"]
[1.89,"UNO.OCHENTAYNUEVE"]
[1.9,"UNO.NOVENTA"]
[1.91,"UNO.NOVENTAYUNO"]
[1.92,"UNO.NOVENTAYDOS"]
[1.93,"UNO.NOVENTAYTRES"]
[1.94,"UNO.NOVENTAYCUATRO"]
[1.95,"UNO.NOVENTAYCINCO"]
[1.96,"UNO.NOVENTAYSEIS"]
[1.97,"UNO.NOVENTAYSIETE"]
[1.98,"UNO.NOVENTAYOCHO"]
[1.99,"UNO.NOVENTAYNUEVE"]
[2,"DOS"]
[2.0099999999999998,"DOS.CERO UNO"]
[2.02,"DOS.CERO DOS"]
[2.0299999999999998,"DOS.CERO TRES"]
[2.04,"DOS.CERO CUATRO"]
[2.0499999999999998,"DOS.CERO CINCO"]
[2.06,"DOS.CERO SEIS"]
[2.0699999999999998,"DOS.CERO SIETE"]
[2.08,"DOS.CERO OCHO"]
[2.09,"DOS.CERO NUEVE"]
[2.1,"DOS.DIEZ"]
[2.11,"DOS.ONCE"]
[2.12,"DOS.DOCE"]
[2.13,"DOS.TRECE"]
[2.14,"DOS.CATORCE"]
[2.15,"DOS.QUINCE"]
[2.16,"DOS.DIECISEIS"]
[2.17,"DOS.DIECISIETE"]
[2.1800000000000002,"DOS.DIECIOCHO"]
[2.19,"DOS.DIECINUEVE"]
[2.2000000000000002,"DOS.VEINTE"]
[2.21,"DOS.VEINTEYUNO"]
[2.2200000000000002,"DOS.VEINTEYDOS"]
[2.23,"DOS.VEINTEYTRES"]
[2.2400000000000002,"DOS.VEINTEYCUATRO"]
[2.25,"DOS.VEINTEYCINCO"]
[2.2599999999999998,"DOS.VEINTEYSEIS"]
[2.27,"DOS.VEINTEYSIETE"]
[2.2799999999999998,"DOS.VEINTEYOCHO"]
[2.29,"DOS.VEINTEYNUEVE"]
[2.2999999999999998,"DOS.TREINTA"]
[2.31,"DOS.TREINTAYUNO"]
[2.3199999999999998,"DOS.TREINTAYDOS"]
[2.33,"DOS.TREINTAYTRES"]
[2.34,"DOS.TREINTAYCUATRO"]
[2.35,"DOS.TREINTAYCINCO"]
[2.36,"DOS.TREINTAYSEIS"]
[2.37,"DOS.TREINTAYSIETE"]
[2.38,"DOS.TREINTAYOCHO"]
[2.39,"DOS.TREINTAYNUEVE"]
[2.4,"DOS.CUARENTA"]
[2.41,"DOS.CUARENTAYUNO"]
[2.42,"DOS.CUARENTAYDOS"]
[2.4300000000000002,"DOS.CUARENTAYTRES"]
[2.44,"DOS.CUARENTAYCUATRO"]
[2.4500000000000002,"DOS.CUARENTAYCINCO"]
[2.46,"DOS.CUARENTAYSEIS"]
[2.4700000000000002,"DOS.CUARENTAYSIETE"]
[2.48,"DOS.CUARENTAYOCHO"]
[2.4900000000000002,"DOS.CUARENTAYNUEVE"]
[2.5,"DOS.CINCUENTA"]
[2.5099999999999998,"DOS.CINCUENTAYUNO"]
[2.52,"DOS.CINCUENTAYDOS"]
[2.5299999999999998,"DOS.CINCUENTAYTRES"]
[2.54,"DOS.CINCUENTAYCUATRO"]
[2.5499999999999998,"DOS.CINCUENTAYCINCO"]
[2.56,"DOS.CINCUENTAYSEIS"]
[2.57,"DOS.CINCUENTAYSIETE"]
[2.58,"DOS.CINCUENTAYOCHO"]
[2.59,"DOS.CINCUENTAYNUEVE"]
[2.6,"DOS.SESENTA"]
[2.61,"DOS.SESENTAYUNO"]
[2.62,"DOS.SESENTAYDOS"]
[2.63,"DOS.SESENTAYTRES"]
[2.64,"DOS.SESENTAYCUATRO"]
[2.65,"DOS.SESENTAYCINCO"]
[2.66,"DOS.SESENTAYSEIS"]
[2.67,"DOS.SESENTAYSIETE"]
[2.68,"DOS.SESENTAYOCHO"]
[2.69,"DOS.SESENTAYNUEVE"]
[2.7,"DOS.SETENTA"]
[2.71,"DOS.SETENTAYUNO"]
[2.72,"DOS.SETENTAYDOS"]
[2.73,"DOS.SETENTAYTRES"]
[2.74,"DOS.SETENTAYCUATRO"]
[2.75,"DOS.SETENTAYCINCO"]
[2.76,"DOS.SETENTAYSEIS"]
[2.77,"DOS.SETENTAYSIETE"]
[2.78,"DOS.SETENTAYOCHO"]
[2.79,"DOS.SETENTAYNUEVE"]
[2.8,"DOS.OCHENTA"]
[2.81,"DOS.OCHENTAYUNO"]
[2.82,"DOS.OCHENTAYDOS"]
[2.83,"DOS.OCHENTAYTRES"]
[2.84,"DOS.OCHENTAYCUATRO"]
[2.85,"DOS.OCHENTAYCINCO"]
[2.86,"DOS.OCHENTAYSEIS"]
[2.87,"DOS.OCHENTAYSIETE"]
[2.88,"DOS.OCHENTAYOCHO"]
[2.89,"DOS.OCHENTAYNUEVE"]
[2.9,"DOS.NOVENTA"]
[2.91,"DOS.NOVENTAYUNO"]
[2.92,"DOS.NOVENTAYDOS"]
[2.93,"DOS.NOVENTAYTRES"]
[2.94,"DOS.NOVENTAYCUATRO"]
[2.95,"DOS.NOVENTAYCINCO"]
[2.96,"DOS.NOVENTAYSEIS"]
[2.97,"DOS.NOVENTAYSIETE"]
[2.98,"DOS.NOVENTAYOCHO"]
[2.99,"DOS.NOVENTAYNUEVE"]
[3,"TRES"]
[3.01,"TRES.CERO UNO"]
[3.02,"TRES.CERO DOS"]
[3.03,"TRES.CERO TRES"]
[3.04,"TRES.CERO CUATRO"]
[3.05,"TRES.CERO CINCO"]
[3.06,"TRES.CERO SEIS"]
[3.07,"TRES.CERO SIETE"]
[3.08,"TRES.CERO OCHO"]
[3.09,"TRES.CERO NUEVE"]
[3.1,"TRES.DIEZ"]
[3.11,"TRES.ONCE"]
[3.12,"TRES.DOCE"]
[3.13,"TRES.TRECE"]
[3.14,"TRES.CATORCE"]
[3.15,"TRES.QUINCE"]
[3.16,"TRES.DIECISEIS"]
[3.17,"TRES.DIECISIETE"]
[3.18,"TRES.DIECIOCHO"]
[3.19,"TRES.DIECINUEVE"]
[3.2,"TRES.VEINTE"]
[3.21,"TRES.VEINTEYUNO"]
[3.22,"TRES.VEINTEYDOS"]
[3.23,"TRES.VEINTEYTRES"]
[3.24,"TRES.VEINTEYCUATRO"]
[3.25,"TRES.VEINTEYCINCO"]
[3.26,"TRES.VEINTEYSEIS"]
[3.27,"TRES.VEINTEYSIETE"]
[3.28,"TRES.VEINTEYOCHO"]
[3.29,"TRES.VEINTEYNUEVE"]
[3.3,"TRES.TREINTA"]
[3.31,"TRES.TREINTAYUNO"]
[3.32,"TRES.TREINTAYDOS"]
[3.33,"TRES.TREINTAYTRES"]
[3.34,"TRES.TREINTAYCUATRO"]
[3.35,"TRES.TREINTAYCINCO"]
[3.36,"TRES.TREINTAYSEIS"]
[3.37,"TRES.TREINTAYSIETE"]
[3.38,"TRES.TREINTAYOCHO"]
[3.39,"TRES.TREINTAYNUEVE"]
[3.4,"TRES.CUARENTA"]
[3.41,"TRES.CUARENTAYUNO"]
[3.42,"TRES.CUARENTAYDOS"]
[3.43,"TRES.CUARENTAYTRES"]
[3.44,"TRES.CUARENTAYCUATRO"]
[3.45,"TRES.CUARENTAYCINCO"]
[3.46,"TRES.CUARENTAYSEIS"]
[3.47,"TRES.CUARENTAYSIETE"]
[3.48,"TRES.CUARENTAYOCHO"]
[3.49,"TRES.CUARENTAYNUEVE"]
[3.5,"TRES.CINCUENTA"]
[3.51,"TRES.CINCUENTAYUNO"]
[3.52,"TRES.CINCUENTAYDOS"]
[3.53,"TRES.CINCUENTAYTRES"]
[3.54,"TRES.CINCUENTAYCUATRO"]
[3.55,"TRES.CINCUENTAYCINCO"]
[3.56,"TRES.CINCUENTAYSEIS"]
[3.57,"TRES.CINCUENTAYSIETE"]
[3.58,"TRES.CINCUENTAYOCHO"]
[3.59,"TRES.CINCUENTAYNUEVE"]
[3.6,"TRES.SESENTA"]
[3.61,"TRES.SESENTAYUNO"]
[3.62,"TRES.SESENTAYDOS"]
[3.63,"TRES.SESENTAYTRES"]
[3.64,"TRES.SESENTAYCUATRO"]
[3.65,"TRES.SESENTAYCINCO"]
[3.66,"TRES.SESENTAYSEIS"]
[3.67,"TRES.SESENTAYSIETE"]
[3.68,"TRES.SESENTAYOCHO"]
[3.69,"TRES.SESENTAYNUEVE"]
[3.7,"TRES.SETENTA"]
[3.71,"TRES.SETENTAYUNO"]
[3.72,"TRES.SETENTAYDOS"]
[3.73,"TRES.SETENTAYTRES"]
[3.74,"TRES.SETENTAYCUATRO"]
[3.75,"TRES.SETENTAYCINCO"]
[3.76,"TRES.SETENTAYSEIS"]
[3.77,"TRES.SETENTAYSIETE"]
[3.78,"TRES.SETENTAYOCHO"]
[3.79,"TRES.SETENTAYNUEVE"]
[3.8,"TRES.OCHENTA"]
[3.81,"TRES.OCHENTAYUNO"]
[3.82,"TRES.OCHENTAYDOS"]
[3.83,"TRES.OCHENTAYTRES"]
[3.84,"TRES.OCHENTAYCUATRO"]
[3.85,"TRES.OCHENTAYCINCO"]
[3.86,"TRES.OCHENTAYSEIS"]
[3.87,"TRES.OCHENTAYSIETE"]
[3.88,"TRES.OCHENTAYOCHO"]
[3.89,"TRES.OCHENTAYNUEVE"]
[3.9,"TRES.NOVENTA"]
[3.91,"TRES.NOVENTAYUNO"]
[3.92,"TRES.NOVENTAYDOS"]
[3.93,"TRES.NOVENTAYTRES"]
[3.94,"TRES.NOVENTAYCUATRO"]
[3.95,"TRES.NOVENTAYCINCO"]
[3.96,"TRES.NOVENTAYSEIS"]
[3.97,"TRES.NOVENTAYSIETE"]
[3.98,"TRES.NOVENTAYOCHO"]
[3.99,"TRES.NOVENTAYNUEVE"]
[4,"CUATRO"]
[4.01,"CUATRO.CERO UNO"]
[4.0199999999999996,"CUATRO.CERO DOS"]
[4.03,"CUATRO.CERO TRES"]
[4.04,"CUATRO.CERO CUATRO"]
[4.05,"CUATRO.CERO CINCO"]
[4.0599999999999996,"CUATRO.CERO SEIS"]
[4.07,"CUATRO.CERO SIETE"]
[4.08,"CUATRO.CERO OCHO"]
[4.09,"CUATRO.CERO NUEVE"]
[4.0999999999999996,"CUATRO.DIEZ"]
[4.1100000000000003,"CUATRO.ONCE"]
[4.12,"CUATRO.DOCE"]
[4.13,"CUATRO.TRECE"]
[4.1399999999999997,"CUATRO.CATORCE"]
[4.1500000000000004,"CUATRO.QUINCE"]
[4.16,"CUATRO.DIECISEIS"]
[4.17,"CUATRO.DIECISIETE"]
[4.18,"CUATRO.DIECIOCHO"]
[4.1900000000000004,"CUATRO.DIECINUEVE"]
[4.2,"CUATRO.VEINTE"]
[4.21,"CUATRO.VEINTEYUNO"]
[4.22,"CUATRO.VEINTEYDOS"]
[4.2300000000000004,"CUATRO.VEINTEYTRES"]
[4.24,"CUATRO.VEINTEYCUATRO"]
[4.25,"CUATRO.VEINTEYCINCO"]
[4.26,"CUATRO.VEINTEYSEIS"]
[4.2699999999999996,"CUATRO.VEINTEYSIETE"]
[4.28,"CUATRO.VEINTEYOCHO"]
[4.29,"CUATRO.VEINTEYNUEVE"]
[4.3,"CUATRO.TREINTA"]
[4.3099999999999996,"CUATRO.TREINTAYUNO"]
[4.32,"CUATRO.TREINTAYDOS"]
[4.33,"CUATRO.TREINTAYTRES"]
[4.34,"CUATRO.TREINTAYCUATRO"]
[4.3499999999999996,"CUATRO.TREINTAYCINCO"]
[4.3600000000000003,"CUATRO.TREINTAYSEIS"]
[4.37,"CUATRO.TREINTAYSIETE"]
[4.38,"CUATRO.TREINTAYOCHO"]
[4.3899999999999997,"CUATRO.TREINTAYNUEVE"]
[4.4000000000000004,"CUATRO.CUARENTA"]
[4.41,"CUATRO.CUARENTAYUNO"]
[4.42,"CUATRO.CUARENTAYDOS"]
[4.43,"CUATRO.CUARENTAYTRES"]
[4.4400000000000004,"CUATRO.CUARENTAYCUATRO"]
[4.45,"CUATRO.CUARENTAYCINCO"]
[4.46,"CUATRO.CUARENTAYSEIS"]
[4.47,"CUATRO.CUARENTAYSIETE"]
[4.4800000000000004,"CUATRO.CUARENTAYOCHO"]
[4.49,"CUATRO.CUARENTAYNUEVE"]
[4.5,"CUATRO.CINCUENTA"]
[4.51,"CUATRO.CINCUENTAYUNO"]
[4.5199999999999996,"CUATRO.CINCUENTAYDOS"]
[4.53,"CUATRO.CINCUENTAYTRES"]
[4.54,"CUATRO.CINCUENTAYCUATRO"]
[4.55,"CUATRO.CINCUENTAYCINCO"]
[4.5599999999999996,"CUATRO.CINCUENTAYSEIS"]
[4.57,"CUATRO.CINCUENTAYSIETE"]
[4.58,"CUATRO.CINCUENTAYOCHO"]
[4.59,"CUATRO.CINCUENTAYNUEVE"]
[4.5999999999999996,"CUATRO.SESENTA"]
[4.6100000000000003,"CUATRO.SESENTAYUNO"]
[4.62,"CUATRO.SESENTAYDOS"]
[4.63,"CUATRO.SESENTAYTRES"]
[4.6399999999999997,"CUATRO.SESENTAYCUATRO"]
[4.6500000000000004,"CUATRO.SESENTAYCINCO"]
[4.66,"CUATRO.SESENTAYSEIS"]
[4.67,"CUATRO.SESENTAYSIETE"]
[4.68,"CUATRO.SESENTAYOCHO"]
[4.6900000000000004,"CUATRO.SESENTAYNUEVE"]
[4.7,"CUATRO.SETENTA"]
[4.71,"CUATRO.SETENTAYUNO"]
[4.72,"CUATRO.SETENTAYDOS"]
[4.7300000000000004,"CUATRO.SETENTAYTRES"]
[4.74,"CUATRO.SETENTAYCUATRO"]
[4.75,"CUATRO.SETENTAYCINCO"]
[4.76,"CUATRO.SETENTAYSEIS"]
[4.7699999999999996,"CUATRO.SETENTAYSIETE"]
[4.78,"CUATRO.SETENTAYOCHO"]
[4.79,"CUATRO.SETENTAYNUEVE"]
[4.8,"CUATRO.OCHENTA"]
[4.8099999999999996,"CUATRO.OCHENTAYUNO"]
[4.82,"CUATRO.OCHENTAYDOS"]
[4.83,"CUATRO.OCHENTAYTRES"]
[4.84,"CUATRO.OCHENTAYCUATRO"]
[4.8499999999999996,"CUATRO.OCHENTAYCINCO"]
[4.8600000000000003,"CUATRO.OCHENTAYSEIS"]
[4.87,"CUATRO.OCHENTAYSIETE"]
[4.88,"CUATRO.OCHENTAYOCHO"]
[4.8899999999999997,"CUATRO.OCHENTAYNUEVE"]
[4.9000000000000004,"CUATRO.NOVENTA"]
[4.91,"CUATRO.NOVENTAYUNO"]
[4.92,"CUATRO.NOVENTAYDOS"]
[4.93,"CUATRO.NOVENTAYTRES"]
[4.9400000000000004,"CUATRO.NOVENTAYCUATRO"]
[4.95,"CUATRO.NOVENTAYCINCO"]
[4.96,"CUATRO.NOVENTAYSEIS"]
[4.97,"CUATRO.NOVENTAYSIETE"]
[4.9800000000000004,"CUATRO.NOVENTAYOCHO"]
[4.99,"CUATRO.NOVENTAYNUEVE"]
[5,"CINCO"]
[5.01,"CINCO.CERO UNO"]
[5.0199999999999996,"CINCO.CERO DOS"]
[5.03,"CINCO.CERO TRES"]
[5.04,"CINCO.CERO CUATRO"]
[5.05,"CINCO.CERO CINCO"]
[5.0599999999999996,"CINCO.CERO SEIS"]
[5.07,"CINCO.CERO SIETE"]
[5.08,"CINCO.CERO OCHO"]
[5.09,"CINCO.CERO NUEVE"]
[5.0999999999999996,"CINCO.DIEZ"]
[5.1100000000000003,"CINCO.ONCE"]
[5.12,"CINCO.DOCE"]
[5.13,"CINCO.TRECE"]
[5.14,"CINCO.CATORCE"]
[5.15,"CINCO.QUINCE"]
[5.16,"CINCO.DIECISEIS"]
[5.17,"CINCO.DIECISIETE"]
[5.18,"CINCO.DIECIOCHO"]
[5.19,"CINCO.DIECINUEVE"]
[5.2,"CINCO.VEINTE"]
[5.21,"CINCO.VEINTEYUNO"]
[5.22,"CINCO.VEINTEYDOS"]
[5.23,"CINCO.VEINTEYTRES"]
[5.24,"CINCO.VEINTEYCUATRO"]
[5.25,"CINCO.VEINTEYCINCO"]
[5.26,"CINCO.VEINTEYSEIS"]
[5.27,"CINCO.VEINTEYSIETE"]
[5.28,"CINCO.VEINTEYOCHO"]
[5.29,"CINCO.VEINTEYNUEVE"]
[5.3,"CINCO.TREINTA"]
[5.31,"CINCO.TREINTAYUNO"]
[5.32,"CINCO.TREINTAYDOS"]
[5.33,"CINCO.TREINTAYTRES"]
[5.34,"CINCO.TREINTAYCUATRO"]
[5.35,"CINCO.TREINTAYCINCO"]
[5.36,"CINCO.TREINTAYSEIS"]
[5.37,"CINCO.TREINTAYSIETE"]
[5.38,"CINCO.TREINTAYOCHO"]
[5.39,"CINCO.TREINTAYNUEVE"]
[5.4,"CINCO.CUARENTA"]
[5.41,"CINCO.CUARENTAYUNO"]
[5.42,"CINCO.CUARENTAYDOS"]
[5.43,"CINCO.CUARENTAYTRES"]
[5.44,"CINCO.CUARENTAYCUATRO"]
[5.45,"CINCO.CUARENTAYCINCO"]
[5.46,"CINCO.CUARENTAYSEIS"]
[5.47,"CINCO.CUARENTAYSIETE"]
[5.48,"CINCO.CUARENTAYOCHO"]
[5.49,"CINCO.CUARENTAYNUEVE"]
[5.5,"CINCO.CINCUENTA"]
[5.51,"CINCO.CINCUENTAYUNO"]
[5.52,"CINCO.CINCUENTAYDOS"]
[5.53,"CINCO.CINCUENTAYTRES"]
[5.54,"CINCO.CINCUENTAYCUATRO"]
[5.55,"CINCO.CINCUENTAYCINCO"]
[5.56,"CINCO.CINCUENTAYSEIS"]
[5.57,"CINCO.CINCUENTAYSIETE"]
[5.58,"CINCO.CINCUENTAYOCHO"]
[5.59,"CINCO.CINCUENTAYNUEVE"]
[5.6,"CINCO.SESENTA"]
[5.61,"CINCO.SESENTAYUNO"]
[5.62,"CINCO.SESENTAYDOS"]
[5.63,"CINCO.SESENTAYTRES"]
[5.64,"CINCO.SESENTAYCUATRO"]
[5.65,"CINCO.SESENTAYCINCO"]
[5.66,"CINCO.SESENTAYSEIS"]
[5.67,"CINCO.SESENTAYSIETE"]
[5.68,"CINCO.SESENTAYOCHO"]
[5.69,"CINCO.SESENTAYNUEVE"]
[5.7,"CINCO.SETENTA"]
[5.71,"CINCO.SETENTAYUNO"]
[5.72,"CINCO.SETENTAYDOS"]
[5.73,"CINCO.SETENTAYTRES"]
[5.74,"CINCO.SETENTAYCUATRO"]
[5.75,"CINCO.SETENTAYCINCO"]
[5.76,"CINCO.SETENTAYSEIS"]
[5.77,"CINCO.SETENTAYSIETE"]
[5.78,"CINCO.SETENTAYOCHO"]
[5.79,"CINCO.SETENTAYNUEVE"]
[5.8,"CINCO.OCHENTA"]
[5.81,"CINCO.OCHENTAYUNO"]
[5.82,"CINCO.OCHENTAYDOS"]
[5.83,"CINCO.OCHENTAYTRES"]
[5.84,"CINCO.OCHENTAYCUATRO"]
[5.85,"CINCO.OCHENTAYCINCO"]
[5.86,"CINCO.OCHENTAYSEIS"]
[5.87,"CINCO.OCHENTAYSIETE"]
[5.88,"CINCO.OCHENTAYOCHO"]
[5.89,"CINCO.OCHENTAYNUEVE"]
[5.9,"CINCO.NOVENTA"]
[5.91,"CINCO.NOVENTAYUNO"]
[5.92,"CINCO.NOVENTAYDOS"]
[5.93,"CINCO.NOVENTAYTRES"]
[5.94,"CINCO.NOVENTAYCUATRO"]
[5.95,"CINCO.NOVENTAYCINCO"]
[5.96,"CINCO.NOVENTAYSEIS"]
[5.97,"CINCO.NOVENTAYSIETE"]
[5.98,"CINCO.NOVENTAYOCHO"]
[5.99,"CINCO.NOVENTAYNUEVE"]
[6,"SEIS"]
[6.01,"SEIS.CERO UNO"]
[6.02,"SEIS.CERO DOS"]
[6.03,"SEIS.CERO TRES"]
[6.04,"SEIS.CERO CUATRO"]
[6.05,"SEIS.CERO CINCO"]
[6.06,"SEIS.CERO SEIS"]
[6.07,"SEIS.CERO SIETE"]
[6.08,"SEIS.CERO OCHO"]
[6.09,"SEIS.CERO NUEVE"]
[6.1,"SEIS.DIEZ"]
[6.11,"SEIS.ONCE"]
[6.12,"SEIS.DOCE"]
[6.13,"SEIS.TRECE"]
[6.14,"SEIS.CATORCE"]
[6.15,"SEIS.QUINCE"]
[6.16,"SEIS.DIECISEIS"]
[6.17,"SEIS.DIECISIETE"]
[6.18,"SEIS.DIECIOCHO"]
[6.19,"SEIS.DIECINUEVE"]
[6.2,"SEIS.VEINTE"]
[6.21,"SEIS.VEINTEYUNO"]
[6.22,"SEIS.VEINTEYDOS"]
[6.23,"SEIS.VEINTEYTRES"]
[6.24,"SEIS.VEINTEYCUATRO"]
[6.25,"SEIS.VEINTEYCINCO"]
[6.26,"SEIS.VEINTEYSEIS"]
[6.27,"SEIS.VEINTEYSIETE"]
[6.28,"SEIS.VEINTEYOCHO"]
[6.29,"SEIS.VEINTEYNUEVE"]
[6.3,"SEIS.TREINTA"]
[6.31,"SEIS.TREINTAYUNO"]
[6.32,"SEIS.TREINTAYDOS"]
[6.33,"SEIS.TREINTAYTRES"]
[6.34,"SEIS.TREINTAYCUATRO"]
[6.35,"SEIS.TREINTAYCINCO"]
[6.36,"SEIS.TREINTAYSEIS"]
[6.37,"SEIS.TREINTAYSIETE"]
[6.38,"SEIS.TREINTAYOCHO"]
[6.39,"SEIS.TREINTAYNUEVE"]
[6.4,"SEIS.CUARENTA"]
[6.41,"SEIS.CUARENTAYUNO"]
[6.42,"SEIS.CUARENTAYDOS"]
[6.43,"SEIS.CUARENTAYTRES"]
[6.44,"SEIS.CUARENTAYCUATRO"]
[6.45,"SEIS.CUARENTAYCINCO"]
[6.46,"SEIS.CUARENTAYSEIS"]
[6.47,"SEIS.CUARENTAYSIETE"]
[6.48,"SEIS.CUARENTAYOCHO"]
[6.49,"SEIS.CUARENTAYNUEVE"]
[6.5,"SEIS.CINCUENTA"]
[6.51,"SEIS.CINCUENTAYUNO"]
[6.52,"SEIS.CINCUENTAYDOS"]
[6.53,"SEIS.CINCUENTAYTRES"]
[6.54,"SEIS.CINCUENTAYCUATRO"]
[6.55,"SEIS.CINCUENTAYCINCO"]
[6.56,"SEIS.CINCUENTAYSEIS"]
[6.57,"SEIS.CINCUENTAYSIETE"]
[6.58,"SEIS.CINCUENTAYOCHO"]
[6.59,"SEIS.CINCUENTAYNUEVE"]
[6.6,"SEIS.SESENTA"]
[6.61,"SEIS.SESENTAYUNO"]
[6.62,"SEIS.SESENTAYDOS"]
[6.63,"SEIS.SESENTAYTRES"]
[6.64,"SEIS.SESENTAYCUATRO"]
[6.65,"SEIS.SESENTAYCINCO"]
[6.66,"SEIS.SESENTAYSEIS"]
[6.67,"SEIS.SESENTAYSIETE"]
[6.68,"SEIS.SESENTAYOCHO"]
[6.69,"SEIS.SESENTAYNUEVE"]
[6.7,"SEIS.SETENTA"]
[6.71,"SEIS.SETENTAYUNO"]
[6.72,"SEIS.SETENTAYDOS"]
[6.73,"SEIS.SETENTAYTRES"]
[6.74,"SEIS.SETENTAYCUATRO"]
[6.75,"SEIS.SETENTAYCINCO"]
[6.76,"SEIS.SETENTAYSEIS"]
[6.77,"SEIS.SETENTAYSIETE"]
[6.78,"SEIS.SETENTAYOCHO"]
[6.79,"SEIS.SETENTAYNUEVE"]
[6.8,"SEIS.OCHENTA"]
[6.81,"SEIS.OCHENTAYUNO"]
[6.82,"SEIS.OCHENTAYDOS"]
[6.83,"SEIS.OCHENTAYTRES"]
[6.84,"SEIS.OCHENTAYCUATRO"]
[6.85,"SEIS.OCHENTAYCINCO"]
[6.86,"SEIS.OCHENTAYSEIS"]
[6.87,"SEIS.OCHENTAYSIETE"]
[6.88,"SEIS.OCHENTAYOCHO"]
[6.89,"SEIS.OCHENTAYNUEVE"]
[6.9,"SEIS.NOVENTA"]
[6.91,"SEIS.NOVENTAYUNO"]
[6.92,"SEIS.NOVENTAYDOS"]
[6.93,"SEIS.NOVENTAYTRES"]
[6.94,"SEIS.NOVENTAYCUATRO"]
[6.95,"SEIS.NOVENTAYCINCO"]
[6.96,"SEIS.NOVENTAYSEIS"]
[6.97,"SEIS.NOVENTAYSIETE"]
[6.98,"SEIS.NOVENTAYOCHO"]
[6.99,"SEIS.NOVENTAYNUEVE"]
[7,"SIETE"]
[7.01,"SIETE.CERO UNO"]
[7.02,"SIETE.CERO DOS"]
[7.03,"SIETE.CERO TRES"]
[7.04,"SIETE.CEROCUATRO"]
[7.05,"SIETE.CERO CINCO"]
[7.06,"SIETE.CERO SEIS"]
[7.07,"SIETE.CERO SIETE"]
[7.08,"SIETE.CERO OCHO"]
[7.09,"SIETE.CERO NUEVE"]
[7.1,"SIETE.DIEZ"]
[7.11,"SIETE.ONCE"]
[7.12,"SIETE.DOCE"]
[7.13,"SIETE.TRECE"]
[7.14,"SIETE.CATORCE"]
[7.15,"SIETE.QUINCE"]
[7.16,"SIETE.DIECISEIS"]
[7.17,"SIETE.DIECISIETE"]
[7.18,"SIETE.DIECIOCHO"]
[7.19,"SIETE.DIECINUEVE"]
[7.2,"SIETE.VEINTE"]
[7.21,"SIETE.VEINTEYUNO"]
[7.22,"SIETE.VEINTEYDOS"]
[7.23,"SIETE.VEINTEYTRES"]
[7.24,"SIETE.VEINTEYCUATRO"]
[7.25,"SIETE.VEINTEYCINCO"]
[7.26,"SIETE.VEINTEYSEIS"]
[7.27,"SIETE.VEINTEYSIETE"]
[7.28,"SIETE.VEINTEYOCHO"]
[7.29,"SIETE.VEINTEYNUEVE"]
[7.3,"SIETE.TREINTA"]
[7.31,"SIETE.TREINTAYUNO"]
[7.32,"SIETE.TREINTAYDOS"]
[7.33,"SIETE.TREINTAYTRES"]
[7.34,"SIETE.TREINTAYCUATRO"]
[7.35,"SIETE.TREINTAYCINCO"]
[7.36,"SIETE.TREINTAYSEIS"]
[7.37,"SIETE.TREINTAYSIETE"]
[7.38,"SIETE.TREINTAYOCHO"]
[7.39,"SIETE.TREINTAYNUEVE"]
[7.4,"SIETE.CUARENTA"]
[7.41,"SIETE.CUARENTAYUNO"]
[7.42,"SIETE.CUARENTAYDOS"]
[7.43,"SIETE.CUARENTAYTRES"]
[7.44,"SIETE.CUARENTAYCUATRO"]
[7.45,"SIETE.CUARENTAYCINCO"]
[7.46,"SIETE.CUARENTAYSEIS"]
[7.47,"SIETE.CUARENTAYSIETE"]
[7.48,"SIETE.CUARENTAYOCHO"]
[7.49,"SIETE.CUARENTAYNUEVE"]
[7.5,"SIETE.CINCUENTA"]
[7.51,"SIETE.CINCUENTAYUNO"]
[7.52,"SIETE.CINCUENTAYDOS"]
[7.53,"SIETE.CINCUENTAYTRES"]
[7.54,"SIETE.CINCUENTAYCUATRO"]
[7.55,"SIETE.CINCUENTAYCINCO"]
[7.56,"SIETE.CINCUENTAYSEIS"]
[7.57,"SIETE.CINCUENTAYSIETE"]
[7.58,"SIETE.CINCUENTAYOCHO"]
[7.59,"SIETE.CINCUENTAYNUEVE"]
[7.6,"SIETE.SESENTA"]
[7.61,"SIETE.SESENTAYUNO"]
[7.62,"SIETE.SESENTAYDOS"]
[7.63,"SIETE.SESENTAYTRES"]
[7.64,"SIETE.SESENTAYCUATRO"]
[7.65,"SIETE.SESENTAYCINCO"]
[7.66,"SIETE.SESENTAYSEIS"]
[7.67,"SIETE.SESENTAYSIETE"]
[7.68,"SIETE.SESENTAYOCHO"]
[7.69,"SIETE.SESENTAYNUEVE"]
[7.7,"SIETE.SETENTA"]
[7.71,"SIETE.SETENTAYUNO"]
[7.72,"SIETE.SETENTAYDOS"]
[7.73,"SIETE.SETENTAYTRES"]
[7.74,"SIETE.SETENTAYCUATRO"]
[7.75,"SIETE.SETENTAYCINCO"]
[7.76,"SIETE.SETENTAYSEIS"]
[7.77,"SIETE.SETENTAYSIETE"]
[7.78,"SIETE.SETENTAYOCHO"]
[7.79,"SIETE.SETENTAYNUEVE"]
[7.8,"SIETE.OCHENTA"]
[7.81,"SIETE.OCHENTAYUNO"]
[7.82,"SIETE.OCHENTAYDOS"]
[7.83,"SIETE.OCHENTAYTRES"]
[7.84,"SIETE.OCHENTAYCUATRO"]
[7.85,"SIETE.OCHENTAYCINCO"]
[7.86,"SIETE.OCHENTAYSEIS"]
[7.87,"SIETE.OCHENTAYSIETE"]
[7.88,"SIETE.OCHENTAYOCHO"]
[7.89,"SIETE.OCHENTAYNUEVE"]
[7.9,"SIETE.NOVENTA"]
[7.91,"SIETE.NOVENTAYUNO"]
[7.92,"SIETE.NOVENTAYDOS"]
[7.93,"SIETE.NOVENTAYTRES"]
[7.94,"SIETE.NOVENTAYCUATRO"]
[7.95,"SIETE.NOVENTAYCINCO"]
[7.96,"SIETE.NOVENTAYSEIS"]
[7.97,"SIETE.NOVENTAYSIETE"]
[7.98,"SIETE.NOVENTAYOCHO"]
[7.99,"SIETE.NOVENTAYNUEVE"]
[8,"OCHO"]
[8.01,"OCHO.CERO UNO"]
[8.02,"OCHO.CERO DOS"]
[8.0299999999999994,"OCHO.CERO TRES"]
[8.0399999999999991,"OCHO.CERO CUATRO"]
[8.0500000000000007,"OCHO.CERO CINCO"]
[8.06,"OCHO.CERO SEIS"]
[8.07,"OCHO.CERO SIETE"]
[8.08,"OCHO.CERO OCHO"]
[8.09,"OCHO.CERO NUEVE"]
[8.1,"OCHO.DIEZ"]
[8.11,"OCHO.ONCE"]
[8.1199999999999992,"OCHO.DOCE"]
[8.1300000000000008,"OCHO.TRECE"]
[8.14,"OCHO.CATORCE"]
[8.15,"OCHO.QUINCE"]
[8.16,"OCHO.DIECISEIS"]
[8.17,"OCHO.DIECISIETE"]
[8.18,"OCHO.DIECIOCHO"]
[8.19,"OCHO.DIECINUEVE"]
[8.1999999999999993,"OCHO.VEINTE"]
[8.2100000000000009,"OCHO.VEINTEYUNO"]
[8.2200000000000006,"OCHO.VEINTEYDOS"]
[8.23,"OCHO.VEINTEYTRES"]
[8.24,"OCHO.VEINTEYCUATRO"]
[8.25,"OCHO.VEINTEYCINCO"]
[8.26,"OCHO.VEINTEYSEIS"]
[8.27,"OCHO.VEINTEYSIETE"]
[8.2799999999999994,"OCHO.VEINTEYOCHO"]
[8.2899999999999991,"OCHO.VEINTEYNUEVE"]
[8.3000000000000007,"OCHO.TREINTA"]
[8.31,"OCHO.TREINTAYUNO"]
[8.32,"OCHO.TREINTAYDOS"]
[8.33,"OCHO.TREINTAYTRES"]
[8.34,"OCHO.TREINTAYCUATRO"]
[8.35,"OCHO.TREINTAYCINCO"]
[8.36,"OCHO.TREINTAYSEIS"]
[8.3699999999999992,"OCHO.TREINTAYSIETE"]
[8.3800000000000008,"OCHO.TREINTAYOCHO"]
[8.39,"OCHO.TREINTAYNUEVE"]
[8.4,"OCHO.CUARENTA"]
[8.41,"OCHO.CUARENTAYUNO"]
[8.42,"OCHO.CUARENTAYDOS"]
[8.43,"OCHO.CUARENTAYTRES"]
[8.44,"OCHO.CUARENTAYCUATRO"]
[8.4499999999999993,"OCHO.CUARENTAYCINCO"]
[8.4600000000000009,"OCHO.CUARENTAYSEIS"]
[8.4700000000000006,"OCHO.CUARENTAYSIETE"]
[8.48,"OCHO.CUARENTAYOCHO"]
[8.49,"OCHO.CUARENTAYNUEVE"]
[8.5,"OCHO.CINCUENTA"]
[8.51,"OCHO.CINCUENTAYUNO"]
[8.52,"OCHO.CINCUENTAYDOS"]
[8.5299999999999994,"OCHO.CINCUENTAYTRES"]
[8.5399999999999991,"OCHO.CINCUENTAYCUATRO"]
[8.5500000000000007,"OCHO.CINCUENTAYCINCO"]
[8.56,"OCHO.CINCUENTAYSEIS"]
[8.57,"OCHO.CINCUENTAYSIETE"]
[8.58,"OCHO.CINCUENTAYOCHO"]
[8.59,"OCHO.CINCUENTAYNUEVE"]
[8.6,"OCHO.SESENTA"]
[8.61,"OCHO.SESENTAYUNO"]
[8.6199999999999992,"OCHO.SESENTAYDOS"]
[8.6300000000000008,"OCHO.SESENTAYTRES"]
[8.64,"OCHO.SESENTAYCUATRO"]
[8.65,"OCHO.SESENTAYCINCO"]
[8.66,"OCHO.SESENTAYSEIS"]
[8.67,"OCHO.SESENTAYSIETE"]
[8.68,"OCHO.SESENTAYOCHO"]
[8.69,"OCHO.SESENTAYNUEVE"]
[8.6999999999999993,"OCHO.SETENTA"]
[8.7100000000000009,"OCHO.SETENTAYUNO"]
[8.7200000000000006,"OCHO.SETENTAYDOS"]
[8.73,"OCHO.SETENTAYTRES"]
[8.74,"OCHO.SETENTAYCUATRO"]
[8.75,"OCHO.SETENTAYCINCO"]
[8.76,"OCHO.SETENTAYSEIS"]
[8.77,"OCHO.SETENTAYSIETE"]
[8.7799999999999994,"OCHO.SETENTAYOCHO"]
[8.7899999999999991,"OCHO.SETENTAYNUEVE"]
[8.8000000000000007,"OCHO.OCHENTA"]
[8.81,"OCHO.OCHENTAYUNO"]
[8.82,"OCHO.OCHENTAYDOS"]
[8.83,"OCHO.OCHENTAYTRES"]
[8.84,"OCHO.OCHENTAYCUATRO"]
[8.85,"OCHO.OCHENTAYCINCO"]
[8.86,"OCHO.OCHENTAYSEIS"]
[8.8699999999999992,"OCHO.OCHENTAYSIETE"]
[8.8800000000000008,"OCHO.OCHENTAYOCHO"]
[8.89,"OCHO.OCHENTAYNUEVE"]
[8.9,"OCHO.NOVENTA"]
[8.91,"OCHO.NOVENTAYUNO"]
[8.92,"OCHO.NOVENTAYDOS"]
[8.93,"OCHO.NOVENTAYTRES"]
[8.94,"OCHO.NOVENTAYCUATRO"]
[8.9499999999999993,"OCHO.NOVENTAYCINCO"]
[8.9600000000000009,"OCHO.NOVENTAYSEIS"]
[8.9700000000000006,"OCHO.NOVENTAYSIETE"]
[8.98,"OCHO.NOVENTAYOCHO"]
[8.99,"OCHO.NOVENTAYNUEVE"]
[9,"NUEVE"]
[9.01,"NUEVE.CERO UNO"]
[9.02,"NUEVE.CERO DOS"]
[9.0299999999999994,"NUEVE.CERO TRES"]
[9.0399999999999991,"NUEVE.CERO CUATRO"]
[9.0500000000000007,"NUEVE.CERO CINCO"]
[9.06,"NUEVE.CERO SEIS"]
[9.07,"NUEVE.CERO SIETE"]
[9.08,"NUEVE.CERO OCHO"]
[9.09,"NUEVE.CERO NUEVE"]
[9.1,"NUEVE.DIEZ"]
[9.11,"NUEVE.ONCE"]
[9.1199999999999992,"NUEVE.DOCE"]
[9.1300000000000008,"NUEVE.TRECE"]
[9.14,"NUEVE.CATORCE"]
[9.15,"NUEVE.QUINCE"]
[9.16,"NUEVE.DIECISEIS"]
[9.17,"NUEVE.DIECISIETE"]
[9.18,"NUEVE.DIECIOCHO"]
[9.19,"NUEVE.DIECINUEVE"]
[9.1999999999999993,"NUEVE.VEINTE"]
[9.2100000000000009,"NUEVE.VEINTEYUNO"]
[9.2200000000000006,"NUEVE.VEINTEYDOS"]
[9.23,"NUEVE.VEINTEYTRES"]
[9.24,"NUEVE.VEINTEYCUATRO"]
[9.25,"NUEVE.VEINTEYCINCO"]
[9.26,"NUEVE.VEINTEYSEIS"]
[9.27,"NUEVE.VEINTEYSIETE"]
[9.2799999999999994,"NUEVE.VEINTEYOCHO"]
[9.2899999999999991,"NUEVE.VEINTEYNUEVE"]
[9.3000000000000007,"NUEVE.TREINTA"]
[9.31,"NUEVE.TREINTAYUNO"]
[9.32,"NUEVE.TREINTAYDOS"]
[9.33,"NUEVE.TREINTAYTRES"]
[9.34,"NUEVE.TREINTAYCUATRO"]
[9.35,"NUEVE.TREINTAYCINCO"]
[9.36,"NUEVE.TREINTAYSEIS"]
[9.3699999999999992,"NUEVE.TREINTAYSIETE"]
[9.3800000000000008,"NUEVE.TREINTAYOCHO"]
[9.39,"NUEVE.TREINTAYNUEVE"]
[9.4,"NUEVE.CUARENTA"]
[9.41,"NUEVE.CUARENTAYUNO"]
[9.42,"NUEVE.CUARENTAYDOS"]
[9.43,"NUEVE.CUARENTAYTRES"]
[9.44,"NUEVE.CUARENTAYCUATRO"]
[9.4499999999999993,"NUEVE.CUARENTAYCINCO"]
[9.4600000000000009,"NUEVE.CUARENTAYSEIS"]
[9.4700000000000006,"NUEVE.CUARENTAYSIETE"]
[9.48,"NUEVE.CUARENTAYOCHO"]
[9.49,"NUEVE.CUARENTAYNUEVE"]
[9.5,"NUEVE.CINCUENTA"]
[9.51,"NUEVE.CINCUENTAYUNO"]
[9.52,"NUEVE.CINCUENTAYDOS"]
[9.5299999999999994,"NUEVE.CINCUENTAYTRES"]
[9.5399999999999991,"NUEVE.CINCUENTAYCUATRO"]
[9.5500000000000007,"NUEVE.CINCUENTAYCINCO"]
[9.56,"NUEVE.CINCUENTAYSEIS"]
[9.57,"NUEVE.CINCUENTAYSIETE"]
[9.58,"NUEVE.CINCUENTAYOCHO"]
[9.59,"NUEVE.CINCUENTAYNUEVE"]
[9.6,"NUEVE.SESENTA"]
[9.61,"NUEVE.SESENTAYUNO"]
[9.6199999999999992,"NUEVE.SESENTAYDOS"]
[9.6300000000000008,"NUEVE.SESENTAYTRES"]
[9.64,"NUEVE.SESENTAYCUATRO"]
[9.65,"NUEVE.SESENTAYCINCO"]
[9.66,"NUEVE.SESENTAYSEIS"]
[9.67,"NUEVE.SESENTAYSIETE"]
[9.68,"NUEVE.SESENTAYOCHO"]
[9.69,"NUEVE.SESENTAYNUEVE"]
[9.6999999999999993,"NUEVE.SETENTA"]
[9.7100000000000009,"NUEVE.SETENTAYUNO"]
[9.7200000000000006,"NUEVE.SETENTAYDOS"]
[9.73,"NUEVE.SETENTAYTRES"]
[9.74,"NUEVE.SETENTAYCUATRO"]
[9.75,"NUEVE.SETENTAYCINCO"]
[9.76,"NUEVE.SETENTAYSEIS"]
[9.77,"NUEVE.SETENTAYSIETE"]
[9.7799999999999994,"NUEVE.SETENTAYOCHO"]
[9.7899999999999991,"NUEVE.SETENTAYNUEVE"]
[9.8000000000000007,"NUEVE.OCHENTA"]
[9.81,"NUEVE.OCHENTAYUNO"]
[9.82,"NUEVE.OCHENTAYDOS"]
[9.83,"NUEVE.OCHENTAYTRES"]
[9.84,"NUEVE.OCHENTAYCUATRO"]
[9.85,"NUEVE.OCHENTAYCINCO"]
[9.86,"NUEVE.OCHENTAYSEIS"]
[9.8699999999999992,"NUEVE.OCHENTAYSIETE"]
[9.8800000000000008,"NUEVE.OCHENTAYOCHO"]
[9.89,"NUEVE.OCHENTAYNUEVE"]
[9.9,"NUEVE.NOVENTA"]
[9.91,"NUEVE.NOVENTAYUNO"]
[9.92,"NUEVE.NOVENTAYDOS"]
[9.93,"NUEVE.NOVENTAYTRES"]
[9.94,"NUEVE.NOVENTAYCUATRO"]
[9.9499999999999993,"NUEVE.NOVENTAYCINCO"]
[9.9600000000000009,"NUEVE.NOVENTAYSEIS"]
[9.9700000000000006,"NUEVE.NOVENTAYSIETE"]
[9.98,"NUEVE.NOVENTAYOCHO"]
[9.99,"NUEVE.NOVENTAYNUEVE"]
[10,"DIEZ"]